{"text_format":"1","workbook":"xlsx","n_sheets":21,"sheets":["Presentation","OldPresentation","By Residency","Age","Dest.","Quarter","Visit Length","(Air)ports","Transport","Gender","Nationality","Purpose","Visits and Spending","4.03","4.05","4.13","4.14","4.15","Ref.Curr","Ref.UKRegn","Ref.Curr.Rates"],"not_rendered":{"charts":4,"images":4,"macros":1,"external_links":0,"defined_names":1,"comments":0,"pivot_tables":1},"unopened":[],"bounds":{"document_bytes":16777216,"sheet_cells":100000,"rows_first":2000,"rows_last":500,"rows_between":2000,"halvings":0,"cell_chars":16384,"cell_head_chars":4096},"cells_cut":0,"cells_raw":0,"read":"whole","date_system":"1900"}

{"sheet":"Presentation","index":0,"n_rows":3,"n_cols":2,"rows_kept":3,"cut":false,"hidden":false,"merged":[[2,1,2,3]]}
[]
[]
[null,"Available online: http://pi.blieque.co.uk/edu/btec/42.2"]

{"sheet":"OldPresentation","index":1,"n_rows":19,"n_cols":5,"rows_kept":19,"cut":false,"hidden":true,"merged":[[18,1,18,3]]}
[]
[]
[null,"Age group average spending lookup",null,null,"View all data"]
[null,"Country","<45","≥45","Higher <45 spending?"]
[null,"Thailand",{"$f":"VLOOKUP($B5,Age!A6:S62,17,FALSE)","v":0},{"$f":"VLOOKUP($B5,Age!A6:S62,18,FALSE)","v":15020668.57825},{"$f":"IF(C5>D5,\"Yes\",\"No\")","v":"No"}]
[]
[null,"Overall Average",{"$f":"AVERAGE(Age!R6:R62)","v":53809117.058368944},{"$f":"AVERAGE(Age!S6:S62)","v":50581909.913521744},{"$f":"IF(C7>D7,\"Yes\",\"No\")","v":"Yes"}]
[]
{"$rows_left_out":12}
{"sheet":"By Residency","index":2,"n_rows":72,"n_cols":23,"rows_kept":72,"cut":false,"hidden":false,"merged":[[2,0,3,0],[1,19,3,19],[1,21,3,22],[1,12,3,12],[1,14,3,14],[1,17,3,17],[2,13,3,13],[1,16,3,16],[1,1,1,11],[2,1,3,1],[2,8,2,9],[2,6,2,7],[2,4,2,5],[2,10,2,11],[2,2,3,2]]}
[]
["←Back to Presentation","Visitor home country and reason for visit",null,null,null,null,null,null,null,null,null,null,"Sort Index",null,"Total Spending",null,"Uses € and spends over £500M","Total Spending in Euros",null,"Total Spending Above Average?",null,"Above/Below Average Count"]
["Nationality","Region","Language","Total Visits","Holiday",null,"Business",null,"Personal",null,"Other"]
[null,null,null,"Top 10 green","Visits","Spending","Visits","Spending","Visits","Spending","Visits","Spending"]
["Canada",{"$f":"VLOOKUP(A5,Ref.Curr!A$1:B$58,2,FALSE)","v":"North America"},{"$f":"VLOOKUP(A5,Ref.Curr!A$1:D$58,4,FALSE)","v":"English 59.3%, French 23.2% (both official); other 17.5%"},{"$f":"SUM(E5,G5,I5,K5)","v":743857.6449999999},279625.3440000001,219295540.66599968,93525.834999999992,111765479.10799992,302356.29299999971,166840873.095,68350.173000000024,32742892.685000014,1,null,{"$f":"SUM(F5,H5,J5,L5)","v":530644785.5539996},null,{"$f":"IF(AND(O5>500000000,VLOOKUP(A5,Ref.Curr!A$1:C$58,3,FALSE)=\"Euro\"),\"Y\",\"N\")","v":"N"},{"$f":"IF(Q5=\"Y\",O5*(Ref.Curr.Rates!B$10/Ref.Curr.Rates!B$17),0)","v":0},null,{"$f":"IF(O5>O$63,\"Y\",\"N\")","v":"Y"},null,"Above Average",{"$f":"COUNTIF(T5:T61,\"Y\")","v":20}]
["USA",{"$f":"VLOOKUP(A6,Ref.Curr!A$1:B$58,2,FALSE)","v":"North America"},{"$f":"VLOOKUP(A6,Ref.Curr!A$1:D$58,4,FALSE)","v":"English 82%, Spanish 11% (2000)"},2790504.2999999984,1123148.9629999984,980601941.25500047,719134.20400000026,905118450.54900038,680446.29099999974,405672120.13599974,267774.842,250914062.96199989,2,null,{"$f":"SUM(F6,H6,J6,L6)","v":2542306574.9020004},null,{"$f":"IF(AND(O6>500000000,VLOOKUP(A6,Ref.Curr!A$1:C$58,3,FALSE)=\"Euro\"),\"Y\",\"N\")","v":"N"},{"$f":"IF(Q6=\"Y\",O6*(Ref.Curr.Rates!B$10/Ref.Curr.Rates!B$17),0)","v":0},null,{"$f":"IF(O6>O$63,\"Y\",\"N\")","v":"Y"},null,"Below Average",{"$f":"COUNTIF(T5:T61,\"N\")","v":37}]
["Austria",{"$f":"VLOOKUP(A7,Ref.Curr!A$1:B$58,2,FALSE)","v":"European Union"},{"$f":"VLOOKUP(A7,Ref.Curr!A$1:D$58,4,FALSE)","v":"German (official nationwide); Slovene, Croatian, Hungarian (each official in one region)"},275129.228,132665.96000000002,83868779.959999979,67434.611999999965,31406220.680000015,60107.605999999992,16171430.299999997,14921.050000000001,10066214.630000001,3,null,141512645.56999999,null,{"$f":"IF(AND(O7>500000000,VLOOKUP(A7,Ref.Curr!A$1:C$58,3,FALSE)=\"Euro\"),\"Y\",\"N\")","v":"N"},{"$f":"IF(Q7=\"Y\",O7*(Ref.Curr.Rates!B$10/Ref.Curr.Rates!B$17),0)","v":0},null,{"$f":"IF(O7>O$63,\"Y\",\"N\")","v":"N"}]
["Belgium",{"$f":"VLOOKUP(A8,Ref.Curr!A$1:B$58,2,FALSE)","v":"European Union"},{"$f":"VLOOKUP(A8,Ref.Curr!A$1:D$58,4,FALSE)","v":"Dutch (Flemish) 60%, French 40%, German less than 1% (all official)"},1188322,544991.43699999992,221413653.73099995,323539.24899999995,77526478.636000037,221467.53100000025,56154956.744000018,98323.78299999985,30647514.556000009,4,null,385742603.667,null,{"$f":"IF(AND(O8>500000000,VLOOKUP(A8,Ref.Curr!A$1:C$58,3,FALSE)=\"Euro\"),\"Y\",\"N\")","v":"N"},{"$f":"IF(Q8=\"Y\",O8*(Ref.Curr.Rates!B$10/Ref.Curr.Rates!B$17),0)","v":0},null,"Y"]
{"$rows_left_out":65}
{"sheet":"Age","index":3,"n_rows":69,"n_cols":21,"rows_kept":69,"cut":false,"hidden":false,"merged":[[2,1,4,1],[2,0,4,0],[3,20,4,20],[1,2,1,15],[2,2,2,15],[2,17,2,18],[3,17,4,17],[3,18,4,18],[3,14,3,15],[3,2,3,3],[3,4,3,5],[3,6,3,7],[3,8,3,9],[3,10,3,11],[3,12,3,13]]}
[]
["←Back to Presentation",null,"Visits to and spending in UK: by age group and country of residence 2013"]
["Nationality","Language","Age",null,null,null,null,null,null,null,null,null,null,null,null,null,null,"Spending in different age groups"]
[null,null,"0-15",null,"16-24",null,"25-34",null,"35-44",null,"45-54",null,"55-64",null,"65+",null,null,"<45","≥45",null,"Key"]
[null,null,"Visits","Spending","Visits","Spending","Visits","Spending","Visits","Spending","Visits","Spending","Visits","Spending","Visits","Spending"]
["Canada",{"$f":"VLOOKUP(A6,Ref.Curr!A$1:D$58,4,FALSE)","v":"English 59.3%, French 23.2% (both official); other 17.5%"},11097.117999999999,2097990.5619999999,64404.999000000003,36387153.752999999,121728.71500000001,83093172.62999998,117459.25500000003,88033414.433000013,172596.43600000005,143220790.32100007,137393.93899999998,98500685.123999998,119177.18299999999,81675178.042000026,null,{"$f":"AVERAGE(D6,F6,H6,J6)","v":52402932.844499998},{"$f":"AVERAGE(L6,N6,P6)","v":107798884.4956667},null,"More visitors per year"]
["USA",{"$f":"VLOOKUP(A7,Ref.Curr!A$1:D$58,4,FALSE)","v":"English 82%, Spanish 11% (2000)"},48833.300999999999,28083431.673000008,267619.81699999998,286015411.49200004,459867.56299999991,406136347.85600007,598632.54700000025,543223267.84200013,678914.50800000015,634831604.59399986,453349.15600000019,406927958.91400009,281273.87200000009,241234303.45999998,null,{"$f":"AVERAGE(D7,F7,H7,J7)","v":315864614.7157501},{"$f":"AVERAGE(L7,N7,P7)","v":427664622.32266665}]
["Austria",{"$f":"VLOOKUP(A8,Ref.Curr!A$1:D$58,4,FALSE)","v":"German (official nationwide); Slovene, Croatian, Hungarian (each official in one region)"},13109.808000000001,5154465.0379999997,34709.540999999997,16130903.628999999,59809.616999999998,25925500.186999999,58098.841,29686695.959999997,72609.58,45246978.151999995,24447.263000000006,13311035.191000002,12344.578,6233483.2060000002,null,19224391.203499999,21597165.51633333]
{"$rows_left_out":62}
{"sheet":"Dest.","index":4,"n_rows":92,"n_cols":5,"rows_kept":92,"cut":false,"hidden":true,"merged":[[1,0,1,4]]}
[]
["Destinations and Purposes of Visitors"]
["Destination","Holiday","Business","Personal","Other"]
["Bedfordshire",41571.003689869671,80816.865443242976,116039.25973659428,25606.12641708658]
["Berkshire",138544.11706688069,184148.9245711618,191237.95462571087,34198.232907294718]
["Bristol UA",142990.30451997774,103581.24804354533,156251.74812277648,25423.943219323814]
["Buckinghamshire",52444.911939341837,111477.07162100157,128961.16929230292,13770.333446029288]
["Cambridgeshire",152723.18060323806,146969.2791201463,211185.17375788034,46166.232444438698]
{"$rows_left_out":85}
{"sheet":"Quarter","index":5,"n_rows":23,"n_cols":15,"rows_kept":23,"cut":false,"hidden":false,"merged":[[1,0,1,8],[2,0,3,0],[2,1,2,2],[2,3,2,4],[2,5,2,6],[2,7,2,8]]}
[]
["2013: Visits to and spending in UK; by residence, quarter, and purpose of visit"]
["Nationality","January - March",null,"April - June",null,"July - September",null,"October - December"]
[null,"Visits","Spending","Visits","Spending","Visits","Spending","Visits","Spending",null,null,"Jan-Mar","Apr-Jun","Jul-Sep","Oct-Dec"]
["North America",null,null,null,null,null,null,null,null,null,"Holiday",152686.21380000014,270210.96339999902,291482.61389999982,1934933.1069999996]
["Holiday",14492.818299999995,114203465.94199999,44457.725600000085,350402405.75699991,60339.139200000136,553832425.35600019,209877.47600000011,181459184.86600009,null,"Business",149907.62140000006,165765.85819999996,144108.5674,1718076.2159999998]
["Business",19083.028599999998,220724428.699,22260.095800000006,315140177.13199991,19510.554300000003,248208557.78700018,204123.25200000015,232810766.03900003,null,"Personal",144164.64410000035,166419.01699999991,173068.67900000044,1853579.7989999999]
["Personal",16894.658300000014,79447275.299999967,25069.042600000033,157691522.92200005,33765.035000000011,212059359.54399994,225515.2249999998,123314835.46500002,null,"Miscellaneous",39080.936999999976,51475.193100000026,55265.819400000008,551644.9369999998]
{"$rows_left_out":16}
{"sheet":"Visit Length","index":6,"n_rows":63,"n_cols":15,"rows_kept":63,"cut":false,"hidden":true,"merged":[[2,1,2,14],[1,0,1,14],[2,0,4,0],[3,13,3,14],[3,1,3,2],[3,3,3,4],[3,5,3,6],[3,7,3,8],[3,9,3,10],[3,11,3,12]]}
[]
["Visits to and spending in UK: by length of stay and country of residence 2013"]
["Nationality","Time"]
[null,0,null,"1-3 nights",null,"4-13 nights",null,"14-27 nights",null,"28-90 nights",null,"3-6 months",null,"6-12 months"]
[null,"Visits","Spending","Visits","Spending","Visits","Spending","Visits","Spending","Visits","Spending","Visits","Spending","Visits","Spending"]
["Canada",3848.268,2614675.9510000004,190928.38300000009,70839625.263000056,382753.72399999981,273178402.80499989,124345.56300000002,123061622.28700003,38272.947000000015,45962525.540000014,1882.0410000000002,8982714.1840000004,1826.7190000000001,8368818.8350000009]
["USA",31976.12,8731376.415000001,936273.62200000021,456512073.75999951,1435515.7649999992,1464045644.9840024,291328.18100000004,395695299.02599984,80648.856,154727657.37800005,12997.731,60798121.364,1764.0250000000001,7191576.4500000002]
["Austria",6606.8460000000023,1052612.9380000001,110456.75400000002,41748732.664000012,136744.93600000005,75652195.589999989,19566.073,20241611.836000007,1754.6189999999999,2993908.335]
{"$rows_left_out":56}
{"sheet":"(Air)ports","index":7,"n_rows":63,"n_cols":14,"rows_kept":63,"cut":false,"hidden":true,"merged":[[1,0,1,13],[2,0,4,0],[2,8,2,13],[3,8,4,8],[3,9,4,9],[3,10,4,10],[3,11,4,11],[3,12,4,12],[3,13,4,13],[3,5,3,7],[3,4,4,4],[3,2,4,2],[3,3,4,3],[3,1,4,1],[2,1,2,7]]}
[]
["Visits to the UK: by UK port  or airport and country of residence 2013"]
["Nationality","Airports",null,null,null,null,null,null,"Sea and Channel Tunnel"]
[null,"Heathrow","Gatwick","Manchester","Stansted","Other",null,null,"Dover seaports","Other channel ports","East coast ports","Long haul sea routes","Irish Sea & land routes","Channel Tunnel"]
[null,null,null,null,null,"England","Scotland","Wales"]
["Canada",372872.70099999936,120969.15899999997,41683.730000000003,8169.4190000000017,46778.625000000007,55883.778999999995,704.22700000000009,15427.534999999998,530.80500000000006,3051.7809999999999,658.7109999999999,15660.597000000003,61466.575999999994]
["USA",1811273.3890000011,137904.92899999995,135603.02000000011,48586.582000000024,129761.89200000005,177111.46199999994,6975.076,41144.976999999984,11228.268,7193.9800000000005,7646.1280000000033,32454.055000000004,243620.54200000054]
["Austria",105719.60200000003,32359.303000000004,16177.187,50245.36,21990.471999999994,34633.074000000001,null,7532.6370000000006,null,2224.087,null,null,4247.5060000000003]
{"$rows_left_out":56}
{"sheet":"Transport","index":8,"n_rows":62,"n_cols":8,"rows_kept":62,"cut":false,"hidden":true,"merged":[[1,0,1,7],[2,1,2,2],[2,0,3,0],[2,3,2,7]]}
[]
["2013: Visits to the UK; by nation of residence and type of vehicle used"]
["Nationality","Air",null,"Sea and Channel Tunnel"]
[null,"All travellers","Foot","Private vehicle","Coach","Goods vehicle","Vehicle type unknown","Total sea and Channel Tunnel"]
["Canada",647061.6399999999,74254.666999999958,5226.4319999999998,17314.905999999999,null,null,96796.004999999917]
["USA",2447216.3499999917,285951.48300000018,15656.129000000001,41531.670999999995,148.667,null,343287.94999999995]
["Austria",261124.99800000046,2618.3220000000001,7871.670000000001,2170.4750000000004,1343.7630000000001,null,14004.230000000001]
["Belgium",184351.606,453451.38899999979,326188.71999999974,155412.58499999996,66950.16,1967.54,1003970.394000003]
{"$rows_left_out":55}
{"sheet":"Gender","index":9,"n_rows":62,"n_cols":19,"rows_kept":62,"cut":false,"hidden":false,"merged":[[1,0,1,8],[2,0,4,0],[2,1,2,4],[2,5,2,8],[3,1,3,2],[3,3,3,4],[3,5,3,6],[3,7,3,8],[3,10,3,11],[3,12,3,13],[2,10,2,13],[2,15,2,18],[3,15,3,16],[3,17,3,18]]}
[]
["2013: Visits to and spending in UK; by nation of residence, gender and purpose of visit"]
["Nationality","Male",null,null,null,"Female",null,null,null,null,"Visits Percentage Split",null,null,null,null,"Spending Percentage Split"]
[null,"Leisure",null,"Business",null,"Leisure",null,"Business",null,null,"Male",null,"Female",null,null,"Male",null,"Female"]
[null,"Visits","Spending","Visits","Spending","Visits","Spending","Visits","Spending",null,"Leisure","Business","Leisure","Business",null,"Leisure","Business","Leisure","Business"]
["Canada",306051.9910000001,202344799.36300004,68208.399000000019,83982865.960999981,344279.81899999996,216534507.08300009,25317.436000000002,27782613.147,null,{"$f":"IFERROR(B6/(B6+D6),\"n/a\")","v":0.81775148847571066},{"$f":"IFERROR(D6/(B6+D6),\"n/a\")","v":0.18224851152428928},{"$f":"IFERROR(F6/(F6+H6),\"n/a\")","v":0.93149993497651928},{"$f":"IFERROR(H6/(F6+H6),\"n/a\")","v":6.8500065023480772E-2},null,{"$f":"IFERROR(C6/(C6+E6),\"n/a\")","v":0.70668965618125856},{"$f":"IFERROR(E6/(C6+E6),\"n/a\")","v":0.29331034381874149},{"$f":"IFERROR(G6/(G6+I6),\"n/a\")","v":0.88628462417678533},{"$f":"IFERROR(I6/(G6+I6),\"n/a\")","v":0.11371537582321474}]
["USA",1003913.0420000001,766133628.64799964,533572.35900000029,698468035.68300033,1065963.101999999,870072657.91900027,185561.84500000003,206650414.86599997,null,{"$f":"IFERROR(B7/(B7+D7),\"n/a\")","v":0.65295777205236682},{"$f":"IFERROR(D7/(B7+D7),\"n/a\")","v":0.34704222794763312},{"$f":"IFERROR(F7/(F7+H7),\"n/a\")","v":0.85173140539882497},{"$f":"IFERROR(H7/(F7+H7),\"n/a\")","v":0.14826859460117511},null,{"$f":"IFERROR(C7/(C7+E7),\"n/a\")","v":0.52310034004908346},{"$f":"IFERROR(E7/(C7+E7),\"n/a\")","v":0.4768996599509166},{"$f":"IFERROR(G7/(G7+I7),\"n/a\")","v":0.80807468504274915},{"$f":"IFERROR(I7/(G7+I7),\"n/a\")","v":0.19192531495725071}]
["Austria",108609.379,60902278.190000005,50805.957000000002,25680964.880000006,99085.236999999994,49204146.699999996,16628.655000000002,5725255.7999999989,null,0.6812981845109306,0.3187018154890694,0.85629508512253649,0.14370491487746348,null,0.70339566907608553,0.29660433092391447,0.89577065215664786,0.10422934784335219]
{"$rows_left_out":55}
{"sheet":"Nationality","index":10,"n_rows":62,"n_cols":13,"rows_kept":62,"cut":false,"hidden":true,"merged":[[2,0,3,0],[1,0,1,12],[2,1,2,3],[2,4,2,6],[2,7,2,9],[2,10,2,12]]}
[]
["Number of visits to UK: by country of residence, purpose of visit and nationality 2013"]
["Nationality","Holiday",null,null,"Business",null,null,"Personal",null,null,"Other"]
[null,"Country of residence","UK","Other","Country of residence","UK","Other","Country of residence","UK","Other","Country of residence","UK","Other"]
["Canada",261835.82799999998,7734.6940000000004,10054.822000000002,87767.215000000026,1490.1360000000002,4268.4840000000004,236087.72500000003,51490.539999999986,14778.027999999998,54450.601999999992,4755.2570000000005,9144.3140000000021]
["USA",1035054.2670000002,32357.669000000002,55737.027000000016,621249.46600000071,39129.606,58755.132000000027,483887.81500000047,148700.39899999992,47858.077000000005,231790.15100000007,10093.415000000001,25891.275999999998]
["Austria",121062.47900000001,689.84399999999994,10913.637000000001,53047.74,3523.0760000000005,10863.796,29412.782999999999,21551.504000000001,9143.3189999999995,14609.173999999997,null,311.87600000000003]
["Belgium",468827.95599999983,12947.177000000001,63216.304000000011,250405.97200000027,13655.036,59478.240999999995,127895.39100000002,56221.851000000017,37350.289000000004,75006.549999999974,13240.171000000002,10077.062000000002]
{"$rows_left_out":55}
{"sheet":"Purpose","index":11,"n_rows":52,"n_cols":5,"rows_kept":52,"cut":false,"hidden":true,"merged":[[52,0,52,4],[53,0,53,4],[54,0,54,4],[55,0,55,4]]}
["Visits in the top 50 UK towns stayed in: by purpose"]
[null,"Holiday","Business","Visiting","Other"]
["London",8501466.3783140853,3239421.260291216,3773352.8200072413,1269908.2313004709]
["Edinburgh",837572.74872417958,133939.77348966393,274869.35695849109,56526.978926440795]
["Manchester",221708.93002336446,335752.46435876604,248047.939120494,182479.36833073775]
["Birmingham",158053.32830619981,483247.9160604268,242668.94921973679,56769.288946793538]
["Liverpool",194540.51289741663,126042.91520305764,135747.81073529666,105521.125134175]
["Glasgow",261782.1574010319,87979.74481360997,142306.57779220183,22942.532850160162]
{"$rows_left_out":45}
{"sheet":"Visits and Spending","index":12,"n_rows":22,"n_cols":7,"rows_kept":22,"cut":false,"hidden":true,"merged":[[2,1,2,2],[2,3,2,4],[2,5,2,6],[1,0,1,6],[2,0,3,0]]}
[]
["Visits and spending in UK: by mode of travel, region of residence and purpose of visit 2013"]
["Region/Purpose","Air",null,"Sea",null,"Channel Tunnel"]
[null,"Visits","Spending","Visits","Spending","Visits","Spending"]
["North America"]
["Holiday",1061380.808,1045023421.7349994,104250.02799999993,33805080.550000004,237143.47100000046,121068979.63600001]
["Business",776585.58900000062,990230278.54299963,7128.304000000001,1210256.2840000002,28946.146000000001,25443394.830000002]
["Personal",935513.89499999885,551059294.8829999,11901.937,4796439.7640000004,35386.751999999993,16657258.584000003]
{"$rows_left_out":15}
{"sheet":"4.03","index":13,"n_rows":65,"n_cols":16,"rows_kept":65,"cut":false,"hidden":true,"merged":[[3,2,3,3],[3,5,3,6],[3,8,3,9],[3,11,3,12],[3,14,3,15]]}
[4.03,"Visits to and spending in UK regions: by region of residence and purpose of visit 2013"]
[]
[]
[null,null,"London",null,null,"Other England",null,null,"Total England",null,null,"Scotland",null,null,"Wales"]
[]
[]
[null,null,"visits","spending",null,"visits","spending",null,"visits","spending",null,"visits","spending",null,"visits","spending"]
[null,null,"(thousands)","(£ million)",null,"(thousands)","(£ million)",null,"(thousands)","(£ million)",null,"(thousands)","(£ million)",null,"(thousands)","(£ million)"]
{"$rows_left_out":58}
{"sheet":"4.05","index":14,"n_rows":81,"n_cols":27,"rows_kept":81,"cut":false,"hidden":true,"merged":[[10,24,10,26],[4,2,4,8],[4,10,4,12],[4,16,4,18],[4,20,4,22],[4,24,4,26],[7,2,7,4],[7,6,7,8],[10,2,10,4],[10,6,10,8],[10,10,10,12],[10,16,10,18],[10,20,10,22]]}
[null,null,null,null,"CAN BE WORKED OUT"]
[4.05,"Average stay and spend per visit and per day: by purpose of visit and country of residence 2013",null,null,null,null,null,null,null,null,null,null,null,null,4.05,"Average stay and spend per visit and per day: by purpose of visit and country of residence 2013"]
[]
[]
[null,null,"Holiday visits",null,null,null,null,null,null,null,"Business visits",null,null,null,null,null,"Visiting friends or relatives",null,null,null,"Miscellaneous",null,null,null,"All visits"]
[]
[]
[null,null,"total",null,null,null,"of which inclusive tour"]
{"$rows_left_out":74}
{"sheet":"4.13","index":15,"n_rows":70,"n_cols":17,"rows_kept":70,"cut":false,"hidden":true,"merged":[[73,0,73,15],[74,0,74,15],[4,2,4,4],[4,6,4,8],[4,10,4,12],[4,14,4,16],[71,0,71,15],[72,0,72,15]]}
[null,null,null,null,"THIS CAN BE WORKED OUT"]
[4.13,"Visits, nights and spending in the top 50 UK towns stayed in: by area of residence 2013"]
[]
[]
[null,null,"North America",null,null,null,"Europe",null,null,null,"Other Countries",null,null,null,"Total World"]
[]
[]
[null,null,"Visits","Nights","Spend",null,"Visits","Nights","Spend",null,"Visits","Nights","Spend",null,"Visits","Nights","Spend"]
{"$rows_left_out":63}
{"sheet":"4.14","index":16,"n_rows":69,"n_cols":17,"rows_kept":69,"cut":false,"hidden":true,"merged":[[3,2,3,4],[3,6,3,8],[3,10,3,12],[3,14,3,16]]}
[4.1399999999999997,"Average stay, spend per visit and per day in the top 50 towns stayed in: by area of residence 2013"]
[]
[]
[null,null,"North America",null,null,null,"Europe",null,null,null,"Other Countries",null,null,null,"Total World"]
[]
[]
[null,null,"stay","spend per","spend per",null,"stay","spend per","spend per",null,"stay","spend per","spend per",null,"stay","spend per","spend per"]
[null,null,"nights","visit (£s)","day (£s)",null,"nights","visit (£s)","day (£s)",null,"nights","visit (£s)","day (£s)",null,"nights","visit (£s)","day (£s)"]
{"$rows_left_out":62}
{"sheet":"4.15","index":17,"n_rows":71,"n_cols":17,"rows_kept":71,"cut":false,"hidden":true,"merged":[[70,0,70,15],[71,0,71,15],[72,0,72,15],[73,0,73,15]]}
[4.1500000000000004,"Visits in the top 50 UK towns stayed in: by age group"]
[]
[]
[null,null,"Age 0-15",null,"Age 16-24",null,"Age 25-34",null,"Age 35-44",null,"Age 45-54",null,"Age 55-64",null,"Age 65 and over",null,"Total"]
[]
[]
[null,null,"visits",null,"visits",null,"visits",null,"visits",null,"visits",null,"visits",null,"visits",null,"visits"]
[null,null,"(thousands)",null,"(thousands)",null,"(thousands)",null,"(thousands)",null,"(thousands)",null,"(thousands)",null,"(thousands)",null,"(thousands)"]
{"$rows_left_out":64}
{"sheet":"Ref.Curr","index":18,"n_rows":58,"n_cols":4,"rows_kept":58,"cut":false,"hidden":true,"merged":[]}
["Australia","Oceania","Australian Dollar","English 79%, native and other languages"]
["Austria","European Union","Euro","German (official nationwide); Slovene, Croatian, Hungarian (each official in one region)"]
["Barbados","The Caribbean","Dollar","English"]
["Belgium","European Union","Euro","Dutch (Flemish) 60%, French 40%, German less than 1% (all official)"]
["Brazil","Central and South America","Real","Portuguese (official), Spanish, English, French"]
["Bulgaria","European Union","Lev","Bulgarian 85%, Turkish 10%, Roma 4%"]
["Canada","North America","Canadian Dollar","English 59.3%, French 23.2% (both official); other 17.5%"]
["Cyprus","European Union","Euro","Greek, Turkish (both official); English"]
{"$rows_left_out":51}
{"sheet":"Ref.UKRegn","index":19,"n_rows":89,"n_cols":2,"rows_kept":89,"cut":false,"hidden":true,"merged":[]}
["Bedfordshire","East England"]
["Berkshire","South East England"]
["Bristol UA","South West England"]
["Buckinghamshire","South East England"]
["Cambridgeshire","East England"]
["Cheshire","North West England"]
["Cornwall","South West England"]
["Cumbria","North West England"]
{"$rows_left_out":82}
{"sheet":"Ref.Curr.Rates","index":20,"n_rows":62,"n_cols":3,"rows_kept":62,"cut":false,"hidden":true,"merged":[[50,0,50,4],[0,0,0,4],[1,0,1,2],[47,0,47,4],[48,0,48,4],[49,0,49,4],[58,0,58,4],[59,0,59,4],[60,0,60,4],[61,0,61,4],[51,0,51,4],[52,0,52,4],[54,2,54,4],[55,2,55,4],[56,0,56,4],[57,0,57,4]]}
["Currency Rates Provided by MSN Money"]
["Click here to visit MSN Money"]
[]
["Name","In US$","   Per US$"]
["Argentina Peso - United States Dollar",0.11796,8.4770000000000003]
["Australian Dollar - United States Dollar",0.87609999999999999,1.141]
["Bahrain Dinar - United States Dollar",2.6362000000000001,0.379]
["Bolivia Bolvianos - United States Dollar",0.14366000000000001,6.9610000000000003]
{"$rows_left_out":54}