{"text_format":"1","workbook":"xlsx","n_sheets":21,"sheets":["Presentation","OldPresentation","By Residency","Age","Dest.","Quarter","Visit Length","(Air)ports","Transport","Gender","Nationality","Purpose","Visits and Spending","4.03","4.05","4.13","4.14","4.15","Ref.Curr","Ref.UKRegn","Ref.Curr.Rates"],"not_rendered":{"charts":4,"images":4,"macros":1,"external_links":0,"defined_names":1,"comments":0,"pivot_tables":1},"unopened":[],"bounds":{"document_bytes":16777216,"sheet_cells":100000,"rows_first":2000,"rows_last":500,"rows_between":2000,"halvings":0,"cell_chars":16384,"cell_head_chars":4096},"cells_cut":0,"cells_raw":0,"read":"whole","date_system":"1900"}

{"sheet":"Presentation","index":0,"n_rows":3,"n_cols":2,"rows_kept":3,"cut":false,"hidden":false,"merged":[[2,1,2,3]]}
[]
[]
[null,"Available online: http://pi.blieque.co.uk/edu/btec/42.2"]

{"sheet":"OldPresentation","index":1,"n_rows":19,"n_cols":5,"rows_kept":19,"cut":false,"hidden":true,"merged":[[18,1,18,3]]}
[]
[]
[null,"Age group average spending lookup",null,null,"View all data"]
[null,"Country","<45","≥45","Higher <45 spending?"]
[null,"Thailand",{"$f":"VLOOKUP($B5,Age!A6:S62,17,FALSE)","v":0},{"$f":"VLOOKUP($B5,Age!A6:S62,18,FALSE)","v":15020668.57825},{"$f":"IF(C5>D5,\"Yes\",\"No\")","v":"No"}]
[]
[null,"Overall Average",{"$f":"AVERAGE(Age!R6:R62)","v":53809117.058368944},{"$f":"AVERAGE(Age!S6:S62)","v":50581909.913521744},{"$f":"IF(C7>D7,\"Yes\",\"No\")","v":"Yes"}]
[]
[null,"Spending by age group",null,null,"Go to"]
[null,"Group","Total Spending",null,"Spending by home country"]
[null,"0-15",{"$f":"Age!D$64","v":644471465.69804609},null,"Spending by age"]
[null,"16-24",{"$f":"Age!F$64","v":2775846334.5987554}]
[null,"25-34",{"$f":"Age!H$64","v":4433663187.9747763}]
[null,"35-44",{"$f":"Age!J$64","v":4403366169.1172075}]
[null,"45-54",{"$f":"Age!L$64","v":4759948139.2954369}]
[null,"55-64",{"$f":"Age!N$64","v":2605666163.6829424}]
[null,"65+",{"$f":"Age!P$64","v":1271131713.8538363}]
[]
[null,"Files available online: http://pi.blieque.co.uk/edu/btec/42.2"]

{"sheet":"By Residency","index":2,"n_rows":72,"n_cols":23,"rows_kept":72,"cut":false,"hidden":false,"merged":[[2,0,3,0],[1,19,3,19],[1,21,3,22],[1,12,3,12],[1,14,3,14],[1,17,3,17],[2,13,3,13],[1,16,3,16],[1,1,1,11],[2,1,3,1],[2,8,2,9],[2,6,2,7],[2,4,2,5],[2,10,2,11],[2,2,3,2]]}
[]
["←Back to Presentation","Visitor home country and reason for visit",null,null,null,null,null,null,null,null,null,null,"Sort Index",null,"Total Spending",null,"Uses € and spends over £500M","Total Spending in Euros",null,"Total Spending Above Average?",null,"Above/Below Average Count"]
["Nationality","Region","Language","Total Visits","Holiday",null,"Business",null,"Personal",null,"Other"]
[null,null,null,"Top 10 green","Visits","Spending","Visits","Spending","Visits","Spending","Visits","Spending"]
["Canada",{"$f":"VLOOKUP(A5,Ref.Curr!A$1:B$58,2,FALSE)","v":"North America"},{"$f":"VLOOKUP(A5,Ref.Curr!A$1:D$58,4,FALSE)","v":"English 59.3%, French 23.2% (both official); other 17.5%"},{"$f":"SUM(E5,G5,I5,K5)","v":743857.6449999999},279625.3440000001,219295540.66599968,93525.834999999992,111765479.10799992,302356.29299999971,166840873.095,68350.173000000024,32742892.685000014,1,null,{"$f":"SUM(F5,H5,J5,L5)","v":530644785.5539996},null,{"$f":"IF(AND(O5>500000000,VLOOKUP(A5,Ref.Curr!A$1:C$58,3,FALSE)=\"Euro\"),\"Y\",\"N\")","v":"N"},{"$f":"IF(Q5=\"Y\",O5*(Ref.Curr.Rates!B$10/Ref.Curr.Rates!B$17),0)","v":0},null,{"$f":"IF(O5>O$63,\"Y\",\"N\")","v":"Y"},null,"Above Average",{"$f":"COUNTIF(T5:T61,\"Y\")","v":20}]
["USA",{"$f":"VLOOKUP(A6,Ref.Curr!A$1:B$58,2,FALSE)","v":"North America"},{"$f":"VLOOKUP(A6,Ref.Curr!A$1:D$58,4,FALSE)","v":"English 82%, Spanish 11% (2000)"},2790504.2999999984,1123148.9629999984,980601941.25500047,719134.20400000026,905118450.54900038,680446.29099999974,405672120.13599974,267774.842,250914062.96199989,2,null,{"$f":"SUM(F6,H6,J6,L6)","v":2542306574.9020004},null,{"$f":"IF(AND(O6>500000000,VLOOKUP(A6,Ref.Curr!A$1:C$58,3,FALSE)=\"Euro\"),\"Y\",\"N\")","v":"N"},{"$f":"IF(Q6=\"Y\",O6*(Ref.Curr.Rates!B$10/Ref.Curr.Rates!B$17),0)","v":0},null,{"$f":"IF(O6>O$63,\"Y\",\"N\")","v":"Y"},null,"Below Average",{"$f":"COUNTIF(T5:T61,\"N\")","v":37}]
["Austria",{"$f":"VLOOKUP(A7,Ref.Curr!A$1:B$58,2,FALSE)","v":"European Union"},{"$f":"VLOOKUP(A7,Ref.Curr!A$1:D$58,4,FALSE)","v":"German (official nationwide); Slovene, Croatian, Hungarian (each official in one region)"},275129.228,132665.96000000002,83868779.959999979,67434.611999999965,31406220.680000015,60107.605999999992,16171430.299999997,14921.050000000001,10066214.630000001,3,null,141512645.56999999,null,{"$f":"IF(AND(O7>500000000,VLOOKUP(A7,Ref.Curr!A$1:C$58,3,FALSE)=\"Euro\"),\"Y\",\"N\")","v":"N"},{"$f":"IF(Q7=\"Y\",O7*(Ref.Curr.Rates!B$10/Ref.Curr.Rates!B$17),0)","v":0},null,{"$f":"IF(O7>O$63,\"Y\",\"N\")","v":"N"}]
["Belgium",{"$f":"VLOOKUP(A8,Ref.Curr!A$1:B$58,2,FALSE)","v":"European Union"},{"$f":"VLOOKUP(A8,Ref.Curr!A$1:D$58,4,FALSE)","v":"Dutch (Flemish) 60%, French 40%, German less than 1% (all official)"},1188322,544991.43699999992,221413653.73099995,323539.24899999995,77526478.636000037,221467.53100000025,56154956.744000018,98323.78299999985,30647514.556000009,4,null,385742603.667,null,{"$f":"IF(AND(O8>500000000,VLOOKUP(A8,Ref.Curr!A$1:C$58,3,FALSE)=\"Euro\"),\"Y\",\"N\")","v":"N"},{"$f":"IF(Q8=\"Y\",O8*(Ref.Curr.Rates!B$10/Ref.Curr.Rates!B$17),0)","v":0},null,"Y"]
["Bulgaria",{"$f":"VLOOKUP(A9,Ref.Curr!A$1:B$58,2,FALSE)","v":"European Union"},{"$f":"VLOOKUP(A9,Ref.Curr!A$1:D$58,4,FALSE)","v":"Bulgarian 85%, Turkish 10%, Roma 4%"},126463.421,21825.165999999997,13738103.537,56849.56700000001,15125244.745999999,38574.693999999996,14169321.130000005,9213.9940000000006,7265696.2929999996,5,null,50298365.706,null,{"$f":"IF(AND(O9>500000000,VLOOKUP(A9,Ref.Curr!A$1:C$58,3,FALSE)=\"Euro\"),\"Y\",\"N\")","v":"N"},{"$f":"IF(Q9=\"Y\",O9*(Ref.Curr.Rates!B$10/Ref.Curr.Rates!B$17),0)","v":0},null,"N"]
["Czech Republic",{"$f":"VLOOKUP(A10,Ref.Curr!A$1:B$58,2,FALSE)","v":"European Union"},{"$f":"VLOOKUP(A10,Ref.Curr!A$1:D$58,4,FALSE)","v":"Czech"},358480.29600000003,117405.41700000002,41815347.380000018,128101.19500000002,33291221.085000005,84400.326000000001,21197719.798,28573.358000000004,25935080.395,6,null,122239368.65800001,null,{"$f":"IF(AND(O10>500000000,VLOOKUP(A10,Ref.Curr!A$1:C$58,3,FALSE)=\"Euro\"),\"Y\",\"N\")","v":"N"},{"$f":"IF(Q10=\"Y\",O10*(Ref.Curr.Rates!B$10/Ref.Curr.Rates!B$17),0)","v":0},null,"N"]
["Cyprus",{"$f":"VLOOKUP(A11,Ref.Curr!A$1:B$58,2,FALSE)","v":"European Union"},{"$f":"VLOOKUP(A11,Ref.Curr!A$1:D$58,4,FALSE)","v":"Greek, Turkish (both official); English"},123277.38499999998,38463.022000000004,28935900.343000006,7704.6010000000015,10629694.292999998,64705.767999999975,58296519.007999986,12403.993999999999,24818586.487999994,7,null,122680700.13199998,null,{"$f":"IF(AND(O11>500000000,VLOOKUP(A11,Ref.Curr!A$1:C$58,3,FALSE)=\"Euro\"),\"Y\",\"N\")","v":"N"},{"$f":"IF(Q11=\"Y\",O11*(Ref.Curr.Rates!B$10/Ref.Curr.Rates!B$17),0)","v":0},null,"N"]
["Denmark",{"$f":"VLOOKUP(A12,Ref.Curr!A$1:B$58,2,FALSE)","v":"European Union"},{"$f":"VLOOKUP(A12,Ref.Curr!A$1:D$58,4,FALSE)","v":"Danish, Faroese, Greenlandic (Inuit dialect), German; English is the predominant second language"},702738.38200000033,335426.74000000034,229299126.10400021,181090.20599999998,101563087.94400001,118212.27199999995,40686064.944000006,68009.164000000004,68110814.265000001,8,null,439659093.25700021,null,{"$f":"IF(AND(O12>500000000,VLOOKUP(A12,Ref.Curr!A$1:C$58,3,FALSE)=\"Euro\"),\"Y\",\"N\")","v":"N"},{"$f":"IF(Q12=\"Y\",O12*(Ref.Curr.Rates!B$10/Ref.Curr.Rates!B$17),0)","v":0},null,"Y"]
["Finland",{"$f":"VLOOKUP(A13,Ref.Curr!A$1:B$58,2,FALSE)","v":"European Union"},{"$f":"VLOOKUP(A13,Ref.Curr!A$1:D$58,4,FALSE)","v":"Finnish 92%, Swedish 6% (both official); small Sami- (Lapp) and Russian-speaking minorities"},215149.82499999992,109055.13299999999,63312310.773000032,44845.756999999983,29688791.290999997,44943.986999999957,14978857.260999998,16304.948000000004,11444164.123,9,null,119424123.44800001,null,{"$f":"IF(AND(O13>500000000,VLOOKUP(A13,Ref.Curr!A$1:C$58,3,FALSE)=\"Euro\"),\"Y\",\"N\")","v":"N"},{"$f":"IF(Q13=\"Y\",O13*(Ref.Curr.Rates!B$10/Ref.Curr.Rates!B$17),0)","v":0},null,"N"]
["France",{"$f":"VLOOKUP(A14,Ref.Curr!A$1:B$58,2,FALSE)","v":"European Union"},{"$f":"VLOOKUP(A14,Ref.Curr!A$1:D$58,4,FALSE)","v":"French 100%, rapidly declining regional dialects (Provençal, Breton, Alsatian, Corsican, Catalan, Basque, Flemish)"},3930395.9380000043,1760810.4169999992,626843585.68200028,800747.40600000089,248240225.366,1109933.4210000047,338545973.97900087,258904.69399999978,134612635.90100002,10,null,1348242420.9280012,null,{"$f":"IF(AND(O14>500000000,VLOOKUP(A14,Ref.Curr!A$1:C$58,3,FALSE)=\"Euro\"),\"Y\",\"N\")","v":"Y"},{"$f":"IF(Q14=\"Y\",O14*(Ref.Curr.Rates!B$10/Ref.Curr.Rates!B$17),0)","v":1684777026.4639463},null,"Y"]
["Germany",{"$f":"VLOOKUP(A15,Ref.Curr!A$1:B$58,2,FALSE)","v":"European Union"},{"$f":"VLOOKUP(A15,Ref.Curr!A$1:D$58,4,FALSE)","v":"German"},3161980.1549999993,1386055.8810000001,674849967.78800035,842786.2079999987,358196514.7530002,719667.48000000021,191668826.29899994,213470.5860000001,182381887.80700001,11,null,1407097196.6470006,null,{"$f":"IF(AND(O15>500000000,VLOOKUP(A15,Ref.Curr!A$1:C$58,3,FALSE)=\"Euro\"),\"Y\",\"N\")","v":"Y"},{"$f":"IF(Q15=\"Y\",O15*(Ref.Curr.Rates!B$10/Ref.Curr.Rates!B$17),0)","v":1758322534.6677365},null,"Y"]
["Greece",{"$f":"VLOOKUP(A16,Ref.Curr!A$1:B$58,2,FALSE)","v":"European Union"},{"$f":"VLOOKUP(A16,Ref.Curr!A$1:D$58,4,FALSE)","v":"Greek 99% (official), English, French"},177738.15599999999,56381.385999999977,38160831.269000009,38882.996000000014,34658238.937999994,71051.962,35856168.204000004,11421.812000000002,37781191.347999997,12,null,146456429.759,null,{"$f":"IF(AND(O16>500000000,VLOOKUP(A16,Ref.Curr!A$1:C$58,3,FALSE)=\"Euro\"),\"Y\",\"N\")","v":"N"},{"$f":"IF(Q16=\"Y\",O16*(Ref.Curr.Rates!B$10/Ref.Curr.Rates!B$17),0)","v":0},null,"N"]
["Hungary",{"$f":"VLOOKUP(A17,Ref.Curr!A$1:B$58,2,FALSE)","v":"European Union"},{"$f":"VLOOKUP(A17,Ref.Curr!A$1:D$58,4,FALSE)","v":"Magyar (Hungarian) 94%, other 6%"},280554.86399999988,50508.938000000009,18381648.019000009,152099.53899999996,24134203.552999999,62361.890999999974,12873344.149999995,15584.496000000001,20077217.363000002,13,null,75466413.085000008,null,{"$f":"IF(AND(O17>500000000,VLOOKUP(A17,Ref.Curr!A$1:C$58,3,FALSE)=\"Euro\"),\"Y\",\"N\")","v":"N"},{"$f":"IF(Q17=\"Y\",O17*(Ref.Curr.Rates!B$10/Ref.Curr.Rates!B$17),0)","v":0},null,"N"]
["Irish Republic",{"$f":"VLOOKUP(A18,Ref.Curr!A$1:B$58,2,FALSE)","v":"European Union"},{"$f":"VLOOKUP(A18,Ref.Curr!A$1:D$58,4,FALSE)","v":"English, Irish (Gaelic) (both official)"},2394513.3089999966,593030.05999999971,228594002.11199993,528852.24999999953,206485816.55700001,963396.17999999726,263382659.26399994,309234.81900000002,85898566.192000031,14,null,784361044.12499988,null,{"$f":"IF(AND(O18>500000000,VLOOKUP(A18,Ref.Curr!A$1:C$58,3,FALSE)=\"Euro\"),\"Y\",\"N\")","v":"Y"},{"$f":"IF(Q18=\"Y\",O18*(Ref.Curr.Rates!B$10/Ref.Curr.Rates!B$17),0)","v":980145296.63404119},null,"Y"]
["Italy",{"$f":"VLOOKUP(A19,Ref.Curr!A$1:B$58,2,FALSE)","v":"European Union"},{"$f":"VLOOKUP(A19,Ref.Curr!A$1:D$58,4,FALSE)","v":"Italian (official); German-, French-, and Slovene-speaking minorities"},1665807.8019999997,817007.73899999901,390175798.11100018,289953.50900000014,158270640.18399996,400329.27200000023,120782946.04599997,158517.28200000009,160837199.625,15,null,830066583.96600008,null,{"$f":"IF(AND(O19>500000000,VLOOKUP(A19,Ref.Curr!A$1:C$58,3,FALSE)=\"Euro\"),\"Y\",\"N\")","v":"Y"},{"$f":"IF(Q19=\"Y\",O19*(Ref.Curr.Rates!B$10/Ref.Curr.Rates!B$17),0)","v":1037259389.9980875},null,"Y"]
["Lithuania",{"$f":"VLOOKUP(A20,Ref.Curr!A$1:B$58,2,FALSE)","v":"European Union"},{"$f":"VLOOKUP(A20,Ref.Curr!A$1:D$58,4,FALSE)","v":"Lithuanian 82% (official), Russian 8%, Polish 6% (2001)"},204945.69599999994,32565.779999999988,15535285.109999998,70055.820000000007,6579081.4850000003,93748.897999999943,28530194.923,8575.1980000000003,15295725.074000001,16,null,65940286.592,null,{"$f":"IF(AND(O20>500000000,VLOOKUP(A20,Ref.Curr!A$1:C$58,3,FALSE)=\"Euro\"),\"Y\",\"N\")","v":"N"},{"$f":"IF(Q20=\"Y\",O20*(Ref.Curr.Rates!B$10/Ref.Curr.Rates!B$17),0)","v":0},null,"N"]
["Luxembourg",{"$f":"VLOOKUP(A21,Ref.Curr!A$1:B$58,2,FALSE)","v":"European Union"},{"$f":"VLOOKUP(A21,Ref.Curr!A$1:D$58,4,FALSE)","v":"Luxermbourgish (national) French, German (both administrative)"},91820.311999999991,39009.745000000003,22820670.532000005,28310.671999999995,10234148.59,19878.156999999996,8756075.6520000026,4621.7380000000012,2113371.1180000002,17,null,43924265.892000005,null,{"$f":"IF(AND(O21>500000000,VLOOKUP(A21,Ref.Curr!A$1:C$58,3,FALSE)=\"Euro\"),\"Y\",\"N\")","v":"N"},{"$f":"IF(Q21=\"Y\",O21*(Ref.Curr.Rates!B$10/Ref.Curr.Rates!B$17),0)","v":0},null,"N",null,"Row Labels","Visits"]
["Malta",{"$f":"VLOOKUP(A22,Ref.Curr!A$1:B$58,2,FALSE)","v":"European Union"},{"$f":"VLOOKUP(A22,Ref.Curr!A$1:D$58,4,FALSE)","v":"Maltese and English (both official)"},84440.468999999997,30662.686999999994,19673909.070000004,13431.934000000008,12193932.859999999,28914.203000000001,11866882.382000001,11431.645,8972983.4889999982,18,null,52707707.801000006,null,{"$f":"IF(AND(O22>500000000,VLOOKUP(A22,Ref.Curr!A$1:C$58,3,FALSE)=\"Euro\"),\"Y\",\"N\")","v":"N"},{"$f":"IF(Q22=\"Y\",O22*(Ref.Curr.Rates!B$10/Ref.Curr.Rates!B$17),0)","v":0},null,"N",null,"European Union",21578569.799000002]
["Netherlands",{"$f":"VLOOKUP(A23,Ref.Curr!A$1:B$58,2,FALSE)","v":"European Union"},{"$f":"VLOOKUP(A23,Ref.Curr!A$1:D$58,4,FALSE)","v":"Dutch, Frisian (both official)"},1921941.5499999998,705305.94700000074,311104712.47099996,635148.19599999953,232413340.66199994,469105.7429999999,122861735.0040001,112381.66399999992,53551746.018000036,19,null,719931534.15499997,null,{"$f":"IF(AND(O23>500000000,VLOOKUP(A23,Ref.Curr!A$1:C$58,3,FALSE)=\"Euro\"),\"Y\",\"N\")","v":"Y"},{"$f":"IF(Q23=\"Y\",O23*(Ref.Curr.Rates!B$10/Ref.Curr.Rates!B$17),0)","v":899633545.52842724},null,"Y",null,"North America",3534361.9449999984]
["Norway",{"$f":"VLOOKUP(A24,Ref.Curr!A$1:B$58,2,FALSE)","v":"Europe"},{"$f":"VLOOKUP(A24,Ref.Curr!A$1:D$58,4,FALSE)","v":"Bokmål Norwegian, Nynorsk Norwegian (both official); small Sami- and Finnish-speaking minorities (Sami is official in six municipalities)"},850214.67699999991,374521.70199999964,230934424.86399987,185410.63299999994,145955179.75500003,157355.49000000011,72037488.560000002,132926.85200000013,87058017.634000003,20,null,535985110.8129999,null,{"$f":"IF(AND(O24>500000000,VLOOKUP(A24,Ref.Curr!A$1:C$58,3,FALSE)=\"Euro\"),\"Y\",\"N\")","v":"N"},{"$f":"IF(Q24=\"Y\",O24*(Ref.Curr.Rates!B$10/Ref.Curr.Rates!B$17),0)","v":0},null,"Y",null,"Europe",2516025.5369999995]
["Poland",{"$f":"VLOOKUP(A25,Ref.Curr!A$1:B$58,2,FALSE)","v":"European Union"},{"$f":"VLOOKUP(A25,Ref.Curr!A$1:D$58,4,FALSE)","v":"Polish 98% (2002)"},1357008.3750000007,185386.78600000002,69466235.622000009,574199.08100000047,136449510.22000006,536563.26200000022,147788353.51399991,60859.245999999977,95323552.719000027,21,null,449027652.07499999,null,{"$f":"IF(AND(O25>500000000,VLOOKUP(A25,Ref.Curr!A$1:C$58,3,FALSE)=\"Euro\"),\"Y\",\"N\")","v":"N"},{"$f":"IF(Q25=\"Y\",O25*(Ref.Curr.Rates!B$10/Ref.Curr.Rates!B$17),0)","v":0},null,"Y",null,"Asia",1790751.0160000003]
["Portugal",{"$f":"VLOOKUP(A26,Ref.Curr!A$1:B$58,2,FALSE)","v":"European Union"},{"$f":"VLOOKUP(A26,Ref.Curr!A$1:D$58,4,FALSE)","v":"Portuguese (official), Mirandese (official, but locally used)"},285672.5639999999,78502.523999999976,33999302.909000002,72229.47199999998,34242039.969999999,104924.24299999991,27692694.373999991,30016.325000000004,18736607.169999998,22,null,114670644.42299999,null,{"$f":"IF(AND(O26>500000000,VLOOKUP(A26,Ref.Curr!A$1:C$58,3,FALSE)=\"Euro\"),\"Y\",\"N\")","v":"N"},{"$f":"IF(Q26=\"Y\",O26*(Ref.Curr.Rates!B$10/Ref.Curr.Rates!B$17),0)","v":0},null,"N",null,"Oceania",1236018.666]
["Romania",{"$f":"VLOOKUP(A27,Ref.Curr!A$1:B$58,2,FALSE)","v":"European Union"},{"$f":"VLOOKUP(A27,Ref.Curr!A$1:D$58,4,FALSE)","v":"Romanian (official), Hungarian, German"},385700.42899999989,48192.683999999987,31936824.240999997,212618.03199999992,47622266.037000008,104542.19799999995,50119961.441,20347.515000000003,28623435.770999998,23,null,158302487.49000001,null,{"$f":"IF(AND(O27>500000000,VLOOKUP(A27,Ref.Curr!A$1:C$58,3,FALSE)=\"Euro\"),\"Y\",\"N\")","v":"N"},{"$f":"IF(Q27=\"Y\",O27*(Ref.Curr.Rates!B$10/Ref.Curr.Rates!B$17),0)","v":0},null,"N",null,"Middle East",799086.60100000014]
["Russia",{"$f":"VLOOKUP(A28,Ref.Curr!A$1:B$58,2,FALSE)","v":"Europe"},{"$f":"VLOOKUP(A28,Ref.Curr!A$1:D$58,4,FALSE)","v":"Russian, others"},213779.95500000002,94504.325999999972,102117444.439,50376.405000000021,44770823.072999999,34009.327000000005,44115074.109999992,34889.897000000012,66254993.941000007,24,null,257258335.56299999,null,{"$f":"IF(AND(O28>500000000,VLOOKUP(A28,Ref.Curr!A$1:C$58,3,FALSE)=\"Euro\"),\"Y\",\"N\")","v":"N"},{"$f":"IF(Q28=\"Y\",O28*(Ref.Curr.Rates!B$10/Ref.Curr.Rates!B$17),0)","v":0},null,"N",null,"Central and South America",621335.75200000009]
["Slovakia",{"$f":"VLOOKUP(A29,Ref.Curr!A$1:B$58,2,FALSE)","v":"European Union"},{"$f":"VLOOKUP(A29,Ref.Curr!A$1:D$58,4,FALSE)","v":"Slovak 84% (official), Hungarian 11%, Roma 2%, Ukrainian 1% (2001)"},147718.92099999997,41198.400999999983,13348730.901999999,61343.024999999987,7435830.5559999999,37948.875999999989,12055107.18,7228.6190000000006,2650200.5100000002,25,null,35489869.147999994,null,{"$f":"IF(AND(O29>500000000,VLOOKUP(A29,Ref.Curr!A$1:C$58,3,FALSE)=\"Euro\"),\"Y\",\"N\")","v":"N"},{"$f":"IF(Q29=\"Y\",O29*(Ref.Curr.Rates!B$10/Ref.Curr.Rates!B$17),0)","v":0},null,"N",null,"South Africa",226165.61800000005]
["Spain",{"$f":"VLOOKUP(A30,Ref.Curr!A$1:B$58,2,FALSE)","v":"European Union"},{"$f":"VLOOKUP(A30,Ref.Curr!A$1:D$58,4,FALSE)","v":"Castilian Spanish 74% (official nationwide); Catalan 17%, Galician 7%, Basque 2% (each official regionally)"},1704475.6039999984,626511.92399999907,303014414.34599978,345665.5839999998,224348651.15099993,598243.02299999946,216961710.09799993,134055.07300000003,160236325.646,26,null,904561101.2409997,null,{"$f":"IF(AND(O30>500000000,VLOOKUP(A30,Ref.Curr!A$1:C$58,3,FALSE)=\"Euro\"),\"Y\",\"N\")","v":"Y"},{"$f":"IF(Q30=\"Y\",O30*(Ref.Curr.Rates!B$10/Ref.Curr.Rates!B$17),0)","v":1130348473.4998915},null,"Y",null,"Western Africa",154145.62900000002]
["Sweden",{"$f":"VLOOKUP(A31,Ref.Curr!A$1:B$58,2,FALSE)","v":"European Union"},{"$f":"VLOOKUP(A31,Ref.Curr!A$1:D$58,4,FALSE)","v":"Swedish, small Sami- and Finnish-speaking minorities"},794295.1179999999,386408.56499999977,219243235.97500014,177711.451,116714675.84699996,143700.80700000006,54255160.630000018,86474.295000000013,56249400.913000003,27,null,446462473.36500007,null,{"$f":"IF(AND(O31>500000000,VLOOKUP(A31,Ref.Curr!A$1:C$58,3,FALSE)=\"Euro\"),\"Y\",\"N\")","v":"N"},{"$f":"IF(Q31=\"Y\",O31*(Ref.Curr.Rates!B$10/Ref.Curr.Rates!B$17),0)","v":0},null,"Y",null,"Other Africa",145206.087]
["Switzerland",{"$f":"VLOOKUP(A32,Ref.Curr!A$1:B$58,2,FALSE)","v":"Europe"},{"$f":"VLOOKUP(A32,Ref.Curr!A$1:D$58,4,FALSE)","v":"German 64%, French 20%, Italian 7% (all official); Romansch 0.5% (national)"},815768.799,283873.39500000002,205818349.43799999,234225.41499999995,140681528.035,225347.48400000003,87969356.193999991,72322.505000000005,68797244.903999999,28,null,503266478.57099998,null,{"$f":"IF(AND(O32>500000000,VLOOKUP(A32,Ref.Curr!A$1:C$58,3,FALSE)=\"Euro\"),\"Y\",\"N\")","v":"N"},{"$f":"IF(Q32=\"Y\",O32*(Ref.Curr.Rates!B$10/Ref.Curr.Rates!B$17),0)","v":0},null,"Y",null,"Northern Africa",111188.99900000001]
["Turkey",{"$f":"VLOOKUP(A33,Ref.Curr!A$1:B$58,2,FALSE)","v":"Europe"},{"$f":"VLOOKUP(A33,Ref.Curr!A$1:D$58,4,FALSE)","v":"Turkish (official), Kurdish, Dimli, Azeri, Kabardian"},154186.48700000005,45096.93499999999,41272101.88000001,50735.203000000016,39346869.436000004,41859.929000000018,25816236.166999988,16494.420000000002,34445240.449000001,29,null,140880447.93200001,null,{"$f":"IF(AND(O33>500000000,VLOOKUP(A33,Ref.Curr!A$1:C$58,3,FALSE)=\"Euro\"),\"Y\",\"N\")","v":"N"},{"$f":"IF(Q33=\"Y\",O33*(Ref.Curr.Rates!B$10/Ref.Curr.Rates!B$17),0)","v":0},null,"N",null,"The Caribbean",89021.638000000021]
["Rest of Europe",{"$f":"VLOOKUP(A34,Ref.Curr!A$1:B$58,2,FALSE)","v":"Europe"},{"$f":"VLOOKUP(A34,Ref.Curr!A$1:D$58,4,FALSE)","v":"n/a"},482075.61899999989,143362.32099999997,104547497.41100006,141548.66799999998,83632151.679999933,134809.16999999995,68273634.051000014,62355.460000000006,96668687.601999998,30,null,353121970.74400002,null,{"$f":"IF(AND(O34>500000000,VLOOKUP(A34,Ref.Curr!A$1:C$58,3,FALSE)=\"Euro\"),\"Y\",\"N\")","v":"N"},{"$f":"IF(Q34=\"Y\",O34*(Ref.Curr.Rates!B$10/Ref.Curr.Rates!B$17),0)","v":0},null,"N",null,"Rest of World",11360.701999999999]
["Egypt",{"$f":"VLOOKUP(A35,Ref.Curr!A$1:B$58,2,FALSE)","v":"Northern Africa"},{"$f":"VLOOKUP(A35,Ref.Curr!A$1:D$58,4,FALSE)","v":"Arabic (official), English and French widely understood by educated classes"},47659.884999999995,16227.780999999997,30588995.116999995,11764.506000000001,23214207.563999992,15813.341,21756626.267000001,3854.2569999999996,3845168.0650000004,31,null,79404997.012999982,null,{"$f":"IF(AND(O35>500000000,VLOOKUP(A35,Ref.Curr!A$1:C$58,3,FALSE)=\"Euro\"),\"Y\",\"N\")","v":"N"},{"$f":"IF(Q35=\"Y\",O35*(Ref.Curr.Rates!B$10/Ref.Curr.Rates!B$17),0)","v":0},null,"N",null,"Grand Total",32813237.989000004]
["Morocco",{"$f":"VLOOKUP(A36,Ref.Curr!A$1:B$58,2,FALSE)","v":"Northern Africa"},{"$f":"VLOOKUP(A36,Ref.Curr!A$1:D$58,4,FALSE)","v":"Arabic (official), Berber dialects, French often used for business, government, and diplomacy"},26361.517,4866.6049999999996,4654358.3150000004,4978.6220000000003,14959350.438999999,11345.73,11888208.700000001,5170.5600000000004,12141925.452000001,32,null,43643842.906000003,null,{"$f":"IF(AND(O36>500000000,VLOOKUP(A36,Ref.Curr!A$1:C$58,3,FALSE)=\"Euro\"),\"Y\",\"N\")","v":"N"},{"$f":"IF(Q36=\"Y\",O36*(Ref.Curr.Rates!B$10/Ref.Curr.Rates!B$17),0)","v":0},null,"N"]
["Tunisia",{"$f":"VLOOKUP(A37,Ref.Curr!A$1:B$58,2,FALSE)","v":"Northern Africa"},{"$f":"VLOOKUP(A37,Ref.Curr!A$1:D$58,4,FALSE)","v":"Arabic (official, commerce), French (commerce)"},{"$f":"SUM(E37,G37,I37,K37)","v":8497.2900000000009},2054.4389999999999,1148231.064,855.80200000000002,1321915.656,3566.1690000000003,7768018.4809999997,2020.88,2282549.3859999999,33,null,12520714.586999999,null,{"$f":"IF(AND(O37>500000000,VLOOKUP(A37,Ref.Curr!A$1:C$58,3,FALSE)=\"Euro\"),\"Y\",\"N\")","v":"N"},{"$f":"IF(Q37=\"Y\",O37*(Ref.Curr.Rates!B$10/Ref.Curr.Rates!B$17),0)","v":0},null,"N"]
["Other North Africa",{"$f":"VLOOKUP(A38,Ref.Curr!A$1:B$58,2,FALSE)","v":"Northern Africa"},{"$f":"VLOOKUP(A38,Ref.Curr!A$1:D$58,4,FALSE)","v":"n/a"},28670.306999999997,5878.5769999999993,6733160.3509999998,10242.093000000001,15409303.662999999,7694.07,5798413.2630000003,4855.567,7310131.3370000003,34,null,{"$f":"SUM(F38,H38,J38,L38)","v":35251008.614},null,{"$f":"IF(AND(O38>500000000,VLOOKUP(A38,Ref.Curr!A$1:C$58,3,FALSE)=\"Euro\"),\"Y\",\"N\")","v":"N"},{"$f":"IF(Q38=\"Y\",O38*(Ref.Curr.Rates!B$10/Ref.Curr.Rates!B$17),0)","v":0},null,"N"]
["South Africa",{"$f":"VLOOKUP(A39,Ref.Curr!A$1:B$58,2,FALSE)","v":"South Africa"},{"$f":"VLOOKUP(A39,Ref.Curr!A$1:D$58,4,FALSE)","v":"IsiZulu 23.8%, IsiXhosa 17.6%, Afrikaans 13.3%, Sepedi 9.4%, English 8.2%, Setswana 8.2%, Sesotho 7.9%, Xitsonga 4.4%, other 7.2%"},226165.61800000005,60686.41800000002,52305503.79900001,52826.704999999994,71709829.177000001,100290.82800000002,79831067.207000017,12361.666999999998,15673473.416999998,35,null,219519873.60000002,null,{"$f":"IF(AND(O39>500000000,VLOOKUP(A39,Ref.Curr!A$1:C$58,3,FALSE)=\"Euro\"),\"Y\",\"N\")","v":"N"},{"$f":"IF(Q39=\"Y\",O39*(Ref.Curr.Rates!B$10/Ref.Curr.Rates!B$17),0)","v":0},null,"N"]
["Nigeria",{"$f":"VLOOKUP(A40,Ref.Curr!A$1:B$58,2,FALSE)","v":"Western Africa"},{"$f":"VLOOKUP(A40,Ref.Curr!A$1:D$58,4,FALSE)","v":"English (official), Hausa, Yoruba, Ibo, Fulani, and more than 200 others"},154145.62900000002,58760.686999999998,93203428.354000002,27117.947999999997,77800271.047999978,51646.112000000016,65277094.986999981,16620.881999999998,34525588.675999999,36,null,270806383.06499994,null,{"$f":"IF(AND(O40>500000000,VLOOKUP(A40,Ref.Curr!A$1:C$58,3,FALSE)=\"Euro\"),\"Y\",\"N\")","v":"N"},{"$f":"IF(Q40=\"Y\",O40*(Ref.Curr.Rates!B$10/Ref.Curr.Rates!B$17),0)","v":0},null,"N"]
["Other Africa",{"$f":"VLOOKUP(A41,Ref.Curr!A$1:B$58,2,FALSE)","v":"Other Africa"},{"$f":"VLOOKUP(A41,Ref.Curr!A$1:D$58,4,FALSE)","v":"n/a"},145206.087,24778.218999999994,34692596.034000002,26289.916999999994,45140428.258999996,74239.736000000034,57793446.02799999,19898.214999999997,25767812.187999997,37,null,163394282.50899997,null,{"$f":"IF(AND(O41>500000000,VLOOKUP(A41,Ref.Curr!A$1:C$58,3,FALSE)=\"Euro\"),\"Y\",\"N\")","v":"N"},{"$f":"IF(Q41=\"Y\",O41*(Ref.Curr.Rates!B$10/Ref.Curr.Rates!B$17),0)","v":0},null,"N"]
["Israel",{"$f":"VLOOKUP(A42,Ref.Curr!A$1:B$58,2,FALSE)","v":"Middle East"},{"$f":"VLOOKUP(A42,Ref.Curr!A$1:D$58,4,FALSE)","v":"Hebrew (official), Arabic, English"},158234.19600000008,59311.796000000046,42404886.519999981,41394.478000000025,28690611.306000005,45571.672000000028,20131645.276000004,11956.250000000002,2913726.5950000007,38,null,94140869.696999997,null,{"$f":"IF(AND(O42>500000000,VLOOKUP(A42,Ref.Curr!A$1:C$58,3,FALSE)=\"Euro\"),\"Y\",\"N\")","v":"N"},{"$f":"IF(Q42=\"Y\",O42*(Ref.Curr.Rates!B$10/Ref.Curr.Rates!B$17),0)","v":0},null,"N"]
["United Arab Emirates",{"$f":"VLOOKUP(A43,Ref.Curr!A$1:B$58,2,FALSE)","v":"Middle East"},{"$f":"VLOOKUP(A43,Ref.Curr!A$1:D$58,4,FALSE)","v":"Arabic (official), Persian, English, Hindi, Urdu"},262312.57499999995,86775.623999999923,222141564.509,40141.764000000032,96825897.84799996,113441.72899999999,135381899.24699989,21953.458000000006,72059511.752999991,39,null,526408873.35699987,null,{"$f":"IF(AND(O43>500000000,VLOOKUP(A43,Ref.Curr!A$1:C$58,3,FALSE)=\"Euro\"),\"Y\",\"N\")","v":"N"},{"$f":"IF(Q43=\"Y\",O43*(Ref.Curr.Rates!B$10/Ref.Curr.Rates!B$17),0)","v":0},null,"Y"]
["Other Middle East",{"$f":"VLOOKUP(A44,Ref.Curr!A$1:B$58,2,FALSE)","v":"Middle East"},{"$f":"VLOOKUP(A44,Ref.Curr!A$1:D$58,4,FALSE)","v":"n/a"},378539.83000000007,186789.07300000003,622814938.09499967,43973.300999999985,161534069.60000005,100224.89200000004,176234316.77100009,47552.563999999998,167032871.85300002,40,null,1127616196.3189998,null,{"$f":"IF(AND(O44>500000000,VLOOKUP(A44,Ref.Curr!A$1:C$58,3,FALSE)=\"Euro\"),\"Y\",\"N\")","v":"N"},{"$f":"IF(Q44=\"Y\",O44*(Ref.Curr.Rates!B$10/Ref.Curr.Rates!B$17),0)","v":0},null,"Y"]
["Hong Kong (China)",{"$f":"VLOOKUP(A45,Ref.Curr!A$1:B$58,2,FALSE)","v":"Asia"},{"$f":"VLOOKUP(A45,Ref.Curr!A$1:D$58,4,FALSE)","v":"Yue (Cantonese), English"},163314.46200000003,63438.205000000016,84934593.387999982,29804.513999999999,54259812.030000024,56038.245000000017,91149488.226999983,14033.498,18529112.52500001,41,null,248873006.16999999,null,{"$f":"IF(AND(O45>500000000,VLOOKUP(A45,Ref.Curr!A$1:C$58,3,FALSE)=\"Euro\"),\"Y\",\"N\")","v":"N"},{"$f":"IF(Q45=\"Y\",O45*(Ref.Curr.Rates!B$10/Ref.Curr.Rates!B$17),0)","v":0},null,"N"]
["Other China",{"$f":"VLOOKUP(A46,Ref.Curr!A$1:B$58,2,FALSE)","v":"Asia"},{"$f":"VLOOKUP(A46,Ref.Curr!A$1:D$58,4,FALSE)","v":"n/a"},232671.35099999997,87155.35500000001,141526589.87,54976.59199999999,98204243.422999978,53383.033999999992,75358680.619000003,37156.370000000003,219873428.26500005,42,null,534962942.17700005,null,{"$f":"IF(AND(O46>500000000,VLOOKUP(A46,Ref.Curr!A$1:C$58,3,FALSE)=\"Euro\"),\"Y\",\"N\")","v":"N"},{"$f":"IF(Q46=\"Y\",O46*(Ref.Curr.Rates!B$10/Ref.Curr.Rates!B$17),0)","v":0},null,"Y"]
["India",{"$f":"VLOOKUP(A47,Ref.Curr!A$1:B$58,2,FALSE)","v":"Asia"},{"$f":"VLOOKUP(A47,Ref.Curr!A$1:D$58,4,FALSE)","v":"Hindi 30%, English, Bengali, Gujarati, Kashmiri, Malayalam, Marathi, Oriya, Punjabi, Tamil, Telugu, Urdu, Kannada, Assamese, Sanskrit, Sindhi (all official); Hindi/Urdu; 1,600+ dialects"},375249.90100000007,130356.71100000002,82078721.861000016,105448.54399999999,208627410.736,110746.22500000003,60346193.077000014,28698.421000000002,89450818.190000013,43,null,440503143.86400002,null,{"$f":"IF(AND(O47>500000000,VLOOKUP(A47,Ref.Curr!A$1:C$58,3,FALSE)=\"Euro\"),\"Y\",\"N\")","v":"N"},{"$f":"IF(Q47=\"Y\",O47*(Ref.Curr.Rates!B$10/Ref.Curr.Rates!B$17),0)","v":0},null,"Y"]
["Japan",{"$f":"VLOOKUP(A48,Ref.Curr!A$1:B$58,2,FALSE)","v":"Asia"},{"$f":"VLOOKUP(A48,Ref.Curr!A$1:D$58,4,FALSE)","v":"Japanese"},220705.51300000004,111478.08600000007,76383178.060000032,61289.805999999968,64317985.067999996,26368.873,15120518.313000003,21568.748,52206343.881999992,44,null,208028025.32300001,null,{"$f":"IF(AND(O48>500000000,VLOOKUP(A48,Ref.Curr!A$1:C$58,3,FALSE)=\"Euro\"),\"Y\",\"N\")","v":"N"},{"$f":"IF(Q48=\"Y\",O48*(Ref.Curr.Rates!B$10/Ref.Curr.Rates!B$17),0)","v":0},null,"N"]
["Pakistan",{"$f":"VLOOKUP(A49,Ref.Curr!A$1:B$58,2,FALSE)","v":"Asia"},{"$f":"VLOOKUP(A49,Ref.Curr!A$1:D$58,4,FALSE)","v":"Urdu 8%, English (both official); Punjabi 48%, Sindhi 12%, Siraiki (a Punjabi variant) 10%, Pashtu 8%, Balochi 3%, Hindko 2%, Brahui 1%, Burushaski, and others 8%"},62967.638999999996,17629.734999999993,55356743.209000021,8991.5550000000003,15583544.454999998,29301.932000000001,32852011.986999996,7044.4169999999986,11265588.735000001,45,null,115057888.38600002,null,{"$f":"IF(AND(O49>500000000,VLOOKUP(A49,Ref.Curr!A$1:C$58,3,FALSE)=\"Euro\"),\"Y\",\"N\")","v":"N"},{"$f":"IF(Q49=\"Y\",O49*(Ref.Curr.Rates!B$10/Ref.Curr.Rates!B$17),0)","v":0},null,"N"]
["Sri Lanka",{"$f":"VLOOKUP(A50,Ref.Curr!A$1:B$58,2,FALSE)","v":"Asia"},{"$f":"VLOOKUP(A50,Ref.Curr!A$1:D$58,4,FALSE)","v":"Sinhala 74% (official and national), Tamil 18% (national), other 8%; English is commonly used in government and spoken competently by about 10%"},24428.273000000001,1661.0550000000001,836460.20000000007,5101.1730000000016,4663846.5749999993,15170.700999999997,10068468.761,2495.3440000000001,2092452.6400000004,46,null,17661228.175999999,null,{"$f":"IF(AND(O50>500000000,VLOOKUP(A50,Ref.Curr!A$1:C$58,3,FALSE)=\"Euro\"),\"Y\",\"N\")","v":"N"},{"$f":"IF(Q50=\"Y\",O50*(Ref.Curr.Rates!B$10/Ref.Curr.Rates!B$17),0)","v":0},null,"N"]
["Thailand",{"$f":"VLOOKUP(A51,Ref.Curr!A$1:B$58,2,FALSE)","v":"Asia"},{"$f":"VLOOKUP(A51,Ref.Curr!A$1:D$58,4,FALSE)","v":"Thai (Siamese), English (secondary language of the elite), ethnic and regional dialects"},74551.746999999988,32832.338000000003,57461084.63099999,7092.7269999999999,10931240.861,28274.833999999992,28331211.407999989,6351.848,20078460.302000001,47,null,116801997.20199998,null,{"$f":"IF(AND(O51>500000000,VLOOKUP(A51,Ref.Curr!A$1:C$58,3,FALSE)=\"Euro\"),\"Y\",\"N\")","v":"N"},{"$f":"IF(Q51=\"Y\",O51*(Ref.Curr.Rates!B$10/Ref.Curr.Rates!B$17),0)","v":0},null,"N"]
["Other Asia",{"$f":"VLOOKUP(A52,Ref.Curr!A$1:B$58,2,FALSE)","v":"Asia"},{"$f":"VLOOKUP(A52,Ref.Curr!A$1:D$58,4,FALSE)","v":"n/a"},636862.13,288926.00200000004,257156875.01500002,122897.402,164794964.62799999,164945.44500000001,220556549.10200003,60093.280999999995,173043210.34200001,48,null,815551599.08700001,null,{"$f":"IF(AND(O52>500000000,VLOOKUP(A52,Ref.Curr!A$1:C$58,3,FALSE)=\"Euro\"),\"Y\",\"N\")","v":"N"},{"$f":"IF(Q52=\"Y\",O52*(Ref.Curr.Rates!B$10/Ref.Curr.Rates!B$17),0)","v":0},null,"Y"]
["Australia",{"$f":"VLOOKUP(A53,Ref.Curr!A$1:B$58,2,FALSE)","v":"Oceania"},{"$f":"VLOOKUP(A53,Ref.Curr!A$1:D$58,4,FALSE)","v":"English 79%, native and other languages"},1069962.1909999999,508647.3870000001,536146905.38300008,73118.03600000008,113397343.10600002,423087.8989999998,491360011.82100052,65108.869000000028,49483384.531999998,49,null,1190387644.8420007,null,{"$f":"IF(AND(O53>500000000,VLOOKUP(A53,Ref.Curr!A$1:C$58,3,FALSE)=\"Euro\"),\"Y\",\"N\")","v":"N"},{"$f":"IF(Q53=\"Y\",O53*(Ref.Curr.Rates!B$10/Ref.Curr.Rates!B$17),0)","v":0},null,"Y"]
["New Zealand",{"$f":"VLOOKUP(A54,Ref.Curr!A$1:B$58,2,FALSE)","v":"Oceania"},{"$f":"VLOOKUP(A54,Ref.Curr!A$1:D$58,4,FALSE)","v":"English, Maori (both official)"},166056.47500000003,54479.570000000007,49022420.165000014,13872.565000000001,17744493.965,88700.468000000023,64524660.616000004,9003.8720000000012,4717215.2959999992,50,null,136008790.04200003,null,{"$f":"IF(AND(O54>500000000,VLOOKUP(A54,Ref.Curr!A$1:C$58,3,FALSE)=\"Euro\"),\"Y\",\"N\")","v":"N"},{"$f":"IF(Q54=\"Y\",O54*(Ref.Curr.Rates!B$10/Ref.Curr.Rates!B$17),0)","v":0},null,"N"]
["Barbados",{"$f":"VLOOKUP(A55,Ref.Curr!A$1:B$58,2,FALSE)","v":"The Caribbean"},{"$f":"VLOOKUP(A55,Ref.Curr!A$1:D$58,4,FALSE)","v":"English"},10132.240000000002,1304.1860000000001,1323748.79,null,null,4356.4880000000012,4867175.2600000007,4471.5660000000007,687806.82499999995,51,null,6878730.8750000009,null,{"$f":"IF(AND(O55>500000000,VLOOKUP(A55,Ref.Curr!A$1:C$58,3,FALSE)=\"Euro\"),\"Y\",\"N\")","v":"N"},{"$f":"IF(Q55=\"Y\",O55*(Ref.Curr.Rates!B$10/Ref.Curr.Rates!B$17),0)","v":0},null,"N"]
["Jamaica",{"$f":"VLOOKUP(A56,Ref.Curr!A$1:B$58,2,FALSE)","v":"The Caribbean"},{"$f":"VLOOKUP(A56,Ref.Curr!A$1:D$58,4,FALSE)","v":"English, Jamaican Creole"},9799.0380000000005,1034.5710000000001,739718.26500000013,1138.8110000000001,1135394.567,7625.6560000000009,3415569.69,null,null,52,null,5290682.5219999999,null,{"$f":"IF(AND(O56>500000000,VLOOKUP(A56,Ref.Curr!A$1:C$58,3,FALSE)=\"Euro\"),\"Y\",\"N\")","v":"N"},{"$f":"IF(Q56=\"Y\",O56*(Ref.Curr.Rates!B$10/Ref.Curr.Rates!B$17),0)","v":0},null,"N"]
["Other Caribbean",{"$f":"VLOOKUP(A57,Ref.Curr!A$1:B$58,2,FALSE)","v":"The Caribbean"},{"$f":"VLOOKUP(A57,Ref.Curr!A$1:D$58,4,FALSE)","v":"n/a"},69090.360000000015,14001.464,15024468.775999999,10367.983,16316535.293000001,32598.785000000014,30900053.114000004,12122.127999999999,3510064.4150000005,53,null,65751121.597999997,null,{"$f":"IF(AND(O57>500000000,VLOOKUP(A57,Ref.Curr!A$1:C$58,3,FALSE)=\"Euro\"),\"Y\",\"N\")","v":"N"},{"$f":"IF(Q57=\"Y\",O57*(Ref.Curr.Rates!B$10/Ref.Curr.Rates!B$17),0)","v":0},null,"N"]
["Brazil",{"$f":"VLOOKUP(A58,Ref.Curr!A$1:B$58,2,FALSE)","v":"Central and South America"},{"$f":"VLOOKUP(A58,Ref.Curr!A$1:D$58,4,FALSE)","v":"Portuguese (official), Spanish, English, French"},257187.24900000007,175569.58700000003,151769210.45599994,28211.573000000011,42437285.724000007,33425.564000000006,25832453.602000009,19980.525000000009,56394134.241999991,54,null,276433084.02399993,null,{"$f":"IF(AND(O58>500000000,VLOOKUP(A58,Ref.Curr!A$1:C$58,3,FALSE)=\"Euro\"),\"Y\",\"N\")","v":"N"},{"$f":"IF(Q58=\"Y\",O58*(Ref.Curr.Rates!B$10/Ref.Curr.Rates!B$17),0)","v":0},null,"N"]
["Mexico",{"$f":"VLOOKUP(A59,Ref.Curr!A$1:B$58,2,FALSE)","v":"Central and South America"},{"$f":"VLOOKUP(A59,Ref.Curr!A$1:D$58,4,FALSE)","v":"Spanish, various Mayan, Nahuatl, and other regional indigenous languages"},108186.37000000005,74808.602000000043,41866941.657999985,7901.9520000000011,6836868.9350000005,13131.512000000001,7382838.2319999989,12344.304,5348079.8510000007,55,null,61434728.675999992,null,{"$f":"IF(AND(O59>500000000,VLOOKUP(A59,Ref.Curr!A$1:C$58,3,FALSE)=\"Euro\"),\"Y\",\"N\")","v":"N"},{"$f":"IF(Q59=\"Y\",O59*(Ref.Curr.Rates!B$10/Ref.Curr.Rates!B$17),0)","v":0},null,"N"]
["Other Central & Sth. America",{"$f":"VLOOKUP(A60,Ref.Curr!A$1:B$58,2,FALSE)","v":"Central and South America"},{"$f":"VLOOKUP(A60,Ref.Curr!A$1:D$58,4,FALSE)","v":"n/a"},255962.133,168466.87699999998,92350786.46100004,26662.336000000003,29596430.347000003,40444.123000000007,41018213.019000009,20388.797000000002,31276756.137000002,56,null,194242185.96400005,null,{"$f":"IF(AND(O60>500000000,VLOOKUP(A60,Ref.Curr!A$1:C$58,3,FALSE)=\"Euro\"),\"Y\",\"N\")","v":"N"},{"$f":"IF(Q60=\"Y\",O60*(Ref.Curr.Rates!B$10/Ref.Curr.Rates!B$17),0)","v":0},null,"N"]
["Rest of the World",{"$f":"VLOOKUP(A61,Ref.Curr!A$1:B$58,2,FALSE)","v":"Rest of World"},{"$f":"VLOOKUP(A61,Ref.Curr!A$1:D$58,4,FALSE)","v":"n/a"},11360.701999999999,6784.88,4342662.46,314.2,20423,2429.8920000000003,2858094.4640000002,1831.7300000000002,2460666.15,57,null,9681846.074000001,null,{"$f":"IF(AND(O61>500000000,VLOOKUP(A61,Ref.Curr!A$1:C$58,3,FALSE)=\"Euro\"),\"Y\",\"N\")","v":"N"},{"$f":"IF(Q61=\"Y\",O61*(Ref.Curr.Rates!B$10/Ref.Curr.Rates!B$17),0)","v":0},null,{"$f":"IF(O61>O$63,\"Y\",\"N\")","v":"N"}]
[]
["Country","Visits per year","Language",null,null,null,null,null,null,null,null,"Average",null,null,{"$f":"AVERAGE(O5:O61)","v":365683936.87505269}]
["France",3930396,"French"]
["Germany",3161980,"German"]
["USA",2790504,"English, Spanish"]
["Irish Republic",2394513,"English, Irish (Gaelic)"]
["Netherlands",1921942,"Dutch, Frisian"]
["Spain",1704476,"Castilian Spanish, Catalan, Galician, Basque"]
["Italy",1665808,"Italian"]
["Poland",1357008,"Polish"]
["Belgium",1188322,"Dutch (Flemish), French"]

{"sheet":"Age","index":3,"n_rows":69,"n_cols":21,"rows_kept":69,"cut":false,"hidden":false,"merged":[[2,1,4,1],[2,0,4,0],[3,20,4,20],[1,2,1,15],[2,2,2,15],[2,17,2,18],[3,17,4,17],[3,18,4,18],[3,14,3,15],[3,2,3,3],[3,4,3,5],[3,6,3,7],[3,8,3,9],[3,10,3,11],[3,12,3,13]]}
[]
["←Back to Presentation",null,"Visits to and spending in UK: by age group and country of residence 2013"]
["Nationality","Language","Age",null,null,null,null,null,null,null,null,null,null,null,null,null,null,"Spending in different age groups"]
[null,null,"0-15",null,"16-24",null,"25-34",null,"35-44",null,"45-54",null,"55-64",null,"65+",null,null,"<45","≥45",null,"Key"]
[null,null,"Visits","Spending","Visits","Spending","Visits","Spending","Visits","Spending","Visits","Spending","Visits","Spending","Visits","Spending"]
["Canada",{"$f":"VLOOKUP(A6,Ref.Curr!A$1:D$58,4,FALSE)","v":"English 59.3%, French 23.2% (both official); other 17.5%"},11097.117999999999,2097990.5619999999,64404.999000000003,36387153.752999999,121728.71500000001,83093172.62999998,117459.25500000003,88033414.433000013,172596.43600000005,143220790.32100007,137393.93899999998,98500685.123999998,119177.18299999999,81675178.042000026,null,{"$f":"AVERAGE(D6,F6,H6,J6)","v":52402932.844499998},{"$f":"AVERAGE(L6,N6,P6)","v":107798884.4956667},null,"More visitors per year"]
["USA",{"$f":"VLOOKUP(A7,Ref.Curr!A$1:D$58,4,FALSE)","v":"English 82%, Spanish 11% (2000)"},48833.300999999999,28083431.673000008,267619.81699999998,286015411.49200004,459867.56299999991,406136347.85600007,598632.54700000025,543223267.84200013,678914.50800000015,634831604.59399986,453349.15600000019,406927958.91400009,281273.87200000009,241234303.45999998,null,{"$f":"AVERAGE(D7,F7,H7,J7)","v":315864614.7157501},{"$f":"AVERAGE(L7,N7,P7)","v":427664622.32266665}]
["Austria",{"$f":"VLOOKUP(A8,Ref.Curr!A$1:D$58,4,FALSE)","v":"German (official nationwide); Slovene, Croatian, Hungarian (each official in one region)"},13109.808000000001,5154465.0379999997,34709.540999999997,16130903.628999999,59809.616999999998,25925500.186999999,58098.841,29686695.959999997,72609.58,45246978.151999995,24447.263000000006,13311035.191000002,12344.578,6233483.2060000002,null,19224391.203499999,21597165.51633333]
["Belgium",{"$f":"VLOOKUP(A9,Ref.Curr!A$1:D$58,4,FALSE)","v":"Dutch (Flemish) 60%, French 40%, German less than 1% (all official)"},47394.093000000001,15639572.375,119942.70899999997,30222588.804000001,218084.34699999998,60911435.63499999,312426.09300000028,93039441.609000027,291753.07900000003,87903388.040999994,153825.15599999993,56623186.16300001,44896.523000000001,41485137.303000003,null,49953259.605750009,62003903.835666664]
["Bulgaria",{"$f":"VLOOKUP(A10,Ref.Curr!A$1:D$58,4,FALSE)","v":"Bulgarian 85%, Turkish 10%, Roma 4%"},4610.076,480414.65500000003,12190.782000000001,7366477.9720000001,25831.389000000003,13208125.768000001,34948.438999999998,13106566.282999998,32072.791000000001,12092544.785000002,14591.358,2248456.841,2218.5860000000002,1860824.3670000001,null,8540396.1695000008,5400608.6643333342]
["Czech Republic",{"$f":"VLOOKUP(A11,Ref.Curr!A$1:D$58,4,FALSE)","v":"Czech"},31888.892,9438366.1640000008,52364.741000000009,28279920.672000002,81293.207000000009,24695332.700999994,97243.668999999994,33931299.184,62988.304000000004,15717807.148,21708.737000000001,5432917.3580000009,10992.746000000001,4779520.7410000004,null,24086229.68025,8643415.0823333338]
["Cyprus",{"$f":"VLOOKUP(A12,Ref.Curr!A$1:D$58,4,FALSE)","v":"Greek, Turkish (both official); English"},3503.502,920943.15899999999,8313.001000000002,6431756.6940000001,17678.879000000001,16344240.314000001,20355.536,37416994.264000006,30811.190000000002,31708880.640999995,28085.275000000009,23464692.960000005,14530.001999999999,6483509.5650000023,null,15278483.607750002,20552361.055333335]
["Denmark",{"$f":"VLOOKUP(A13,Ref.Curr!A$1:D$58,4,FALSE)","v":"Danish, Faroese, Greenlandic (Inuit dialect), German; English is the predominant second language"},18020.357,8485848.0789999999,87718.069999999992,50094735.099000007,124374.17299999998,58376166.567000002,152394.13700000002,141547140.26100001,172197.05499999996,102313709.77,92870.808000000005,54619193.482000008,55163.781999999999,24444034.592,null,64625972.501500003,60458979.281333335]
["Finland",{"$f":"VLOOKUP(A14,Ref.Curr!A$1:D$58,4,FALSE)","v":"Finnish 92%, Swedish 6% (both official); small Sami- (Lapp) and Russian-speaking minorities"},2203.3619999999996,927786.81599999999,22942.900999999998,13248805.296999998,50495.650999999998,24627142.618999995,55498.000000000007,31850087.967000008,49531.473000000013,28730793.448000003,25809.309999999994,16491946.344999999,8669.1280000000006,3898459.9870000007,null,17663455.67475,16373733.26]
["France",{"$f":"VLOOKUP(A15,Ref.Curr!A$1:D$58,4,FALSE)","v":"French 100%, rapidly declining regional dialects (Provençal, Breton, Alsatian, Corsican, Catalan, Basque, Flemish)"},369259.94800000003,116334781.32500002,479343.62599999981,191018313.611,859532.55799999984,282589217.56499994,865061.95399999968,286167360.96900004,737640.23399999982,256255097.17500001,403574.50899999996,144045730.32699999,215983.109,73153046.82100001,null,219027418.36750001,157817958.10766664]
["Germany",{"$f":"VLOOKUP(A16,Ref.Curr!A$1:D$58,4,FALSE)","v":"German"},180839.21799999999,89078026.901000008,420540.65300000005,216516082.37500003,612135.23100000015,264464934.79100007,683013.6370000001,278579015.63200003,758233.73999999987,315516749.82100004,341702.212,169737725.87800005,157810.10800000001,73143328.483000025,null,212159514.92475003,186132601.39400005]
["Greece",{"$f":"VLOOKUP(A17,Ref.Curr!A$1:D$58,4,FALSE)","v":"Greek 99% (official), English, French"},1208.4900000000002,233384.82800000001,17123.730000000003,29205360.743000004,46734.189000000006,37978669.134999998,31593.836000000003,25447992.403999999,36608.078999999998,25454142.202000007,31797.594000000005,22692726.439999998,12672.237999999998,5581137.3700000001,null,23216351.7775,17909335.337333333]
["Hungary",{"$f":"VLOOKUP(A18,Ref.Curr!A$1:D$58,4,FALSE)","v":"Magyar (Hungarian) 94%, other 6%"},6826.9949999999999,1813828.2770000002,39635.225000000006,25372812.401999999,67814.616999999998,21779030.397,71078.34,10467905.029000003,68688.37999999999,10173185.733000001,22502.881999999998,4542107.0289999992,4008.4249999999997,1330078.74,null,14858394.026250001,5348457.1673333338]
["Irish Republic",{"$f":"VLOOKUP(A19,Ref.Curr!A$1:D$58,4,FALSE)","v":"English, Irish (Gaelic) (both official)"},88727.044445075444,21656430.794046044,264008.46475135139,73095630.822755724,496110.47079271922,180127696.98277509,552028.72667408199,180403496.68920648,486532.24825894146,163142161.69443756,314115.14215085836,109369498.34094255,192991.21192697191,89748252.249836639,null,113820813.82219583,120753304.09507225]
["Italy",{"$f":"VLOOKUP(A20,Ref.Curr!A$1:D$58,4,FALSE)","v":"Italian (official); German-, French-, and Slovene-speaking minorities"},86346.862000000008,54368196.523000002,288515.68199999997,202252665.75299999,366605.55600000004,181570339.56700003,351003.68699999992,146157036.73300004,338635.84,144794054.98800004,160640.98699999996,72475335.664999992,74059.188000000009,28760454.184999999,null,146087059.64400002,82009948.279333338]
["Lithuania",{"$f":"VLOOKUP(A21,Ref.Curr!A$1:D$58,4,FALSE)","v":"Lithuanian 82% (official), Russian 8%, Polish 6% (2001)"},10137.681,3503641.0159999998,29607.486000000001,13486328.821,59744.273000000001,26205751.197000001,39603.827000000005,8841581.6179999989,47929.278999999995,7921720.506000001,14357.349999999999,3152057.1570000001,3565.8,3023420.986,null,13009325.663000001,4699066.2163333334]
["Luxembourg",{"$f":"VLOOKUP(A22,Ref.Curr!A$1:D$58,4,FALSE)","v":"Luxermbourgish (national) French, German (both administrative)"},680.90700000000004,65065.140999999996,7524.3230000000003,2827356.4899999998,23015.878999999997,13439854.946000002,25403.346999999998,13496262.979999999,17211.798000000003,8513784.4130000006,15176.9,3550272.3630000004,2807.1580000000004,2108676.6850000001,null,7457134.88925,4724244.4870000007]
["Malta",{"$f":"VLOOKUP(A23,Ref.Curr!A$1:D$58,4,FALSE)","v":"Maltese and English (both official)"},4941.1490000000003,2386556.2270000004,5086.9360000000006,9583971.6210000012,20760.298999999999,12862626.165999997,13343.485000000001,8287280.7780000009,15352.104000000001,7453083.9810000006,17995.587,8592961.0420000013,6960.9090000000006,3713869.2969999998,null,8280108.6979999999,6586638.1066666665]
["Netherlands",{"$f":"VLOOKUP(A24,Ref.Curr!A$1:D$58,4,FALSE)","v":"Dutch, Frisian (both official)"},91171.318000000014,29035862.453000002,186156.17800000001,73946197.805999994,354899.63100000011,124938895.22699998,464013.95300000004,164388659.40900001,466101.07299999992,187243635.16899997,255645.378,99326490.169000015,103954.01900000001,41563890.205000006,null,98077403.723749995,109378005.18099999]
["Norway",{"$f":"VLOOKUP(A25,Ref.Curr!A$1:D$58,4,FALSE)","v":"Bokmål Norwegian, Nynorsk Norwegian (both official); small Sami- and Finnish-speaking minorities (Sami is official in six municipalities)"},27797.692000000003,11787492.540000001,96057.892000000007,50766426.588,178588.48699999996,108085035.58299999,189343.57300000003,112498560.85399997,225211.65700000004,181157525.46999997,99713.214000000007,51709407.239,32097.281000000003,19619791.826000005,null,70784378.891249985,84162241.511666656]
["Poland",{"$f":"VLOOKUP(A26,Ref.Curr!A$1:D$58,4,FALSE)","v":"Polish 98% (2002)"},47857.932999999997,14375084.510999998,173151.81499999997,120639096.07500003,434558.22600000002,137690201.37099999,323853.89,80347315.403999999,194711.37500000003,45941169.987000003,146671.82500000001,40525405.127000004,35062.171000000002,9614868.5389999989,null,88262924.34025,32027147.884333339]
["Portugal",{"$f":"VLOOKUP(A27,Ref.Curr!A$1:D$58,4,FALSE)","v":"Portuguese (official), Mirandese (official, but locally used)"},13501.11,6371303.0240000002,24340.367000000006,7737859.1230000006,62023.714,24343008.078000002,67918.173000000024,24534149.991999999,63414.594000000005,30954024.553000007,27406.685000000001,10168644.636,27067.920999999998,10835806.075000001,null,15746580.05425,17319491.754666671]
["Romania",{"$f":"VLOOKUP(A28,Ref.Curr!A$1:D$58,4,FALSE)","v":"Romanian (official), Hungarian, German"},1979.7830000000004,678118.30200000014,59183.121999999996,43438234.855999999,121961.808,56041200.967,113093.33200000001,34999352.924999997,65949.652999999991,12037825.544,17526.292000000001,7877104.7710000006,6006.4390000000003,3589828.1539999996,null,33789226.762500003,7834919.4896666668]
["Russia",{"$f":"VLOOKUP(A29,Ref.Curr!A$1:D$58,4,FALSE)","v":"Russian, others"},17832.644,18563404.332999997,25210.593999999997,41986026.329000004,53115.474000000009,51178946.063000008,56122.951999999997,70793155.784000024,38868.233,51804206.233999997,14105.174000000001,20722945.23,8524.884,2464132.6899999995,null,45630383.127250008,24997094.717999998]
["Slovakia",{"$f":"VLOOKUP(A30,Ref.Curr!A$1:D$58,4,FALSE)","v":"Slovak 84% (official), Hungarian 11%, Roma 2%, Ukrainian 1% (2001)"},2602.4859999999999,404489.80600000004,28439.768999999997,10130865.317000002,38182.756000000001,9461673.5440000016,42847.119000000006,10144523.748000002,20202.723999999998,2247456.4390000002,12939.505999999999,2260208.1750000003,2504.5610000000001,873772.74100000004,null,7535388.1037500016,1793812.4516666669]
["Spain",{"$f":"VLOOKUP(A31,Ref.Curr!A$1:D$58,4,FALSE)","v":"Castilian Spanish 74% (official nationwide); Catalan 17%, Galician 7%, Basque 2% (each official regionally)"},73963.64899999999,35177787.022000007,163754.81,103990980.46500002,368523.15000000008,212985789.92500004,424867.47300000006,206888511.808,338601.28700000007,194482643.38000003,187560.29500000001,103990622.226,145503.37500000003,47140163.927999996,null,139760767.30500001,115204476.51133333]
["Sweden",{"$f":"VLOOKUP(A32,Ref.Curr!A$1:D$58,4,FALSE)","v":"Swedish, small Sami- and Finnish-speaking minorities"},26912.116000000002,16760413.790999997,99208.770999999979,71148333.081999987,146488.56400000001,85498554.822999999,187579.96,89171425.70100002,185717.08899999995,99044527.930000022,109985.39000000001,67525955.442000002,37987.197999999997,17759877.036000002,null,65644681.849250004,61443453.469333351]
["Switzerland",{"$f":"VLOOKUP(A33,Ref.Curr!A$1:D$58,4,FALSE)","v":"German 64%, French 20%, Italian 7% (all official); Romansch 0.5% (national)"},15195.811000000003,7202649.779000001,77054.885999999999,48736954.703999996,164956.43899999998,101700970.296,225912.05499999999,132136057.838,206901.05100000004,142061969.64800003,92395.311000000016,52175335.658,32753.350000000006,19260501.448000003,null,72444158.154249996,71165935.584666684]
["Turkey",{"$f":"VLOOKUP(A34,Ref.Curr!A$1:D$58,4,FALSE)","v":"Turkish (official), Kurdish, Dimli, Azeri, Kabardian"},3017.864,3994306.432,12501.756000000001,23335811.521000005,37155.742000000006,41837203.739,44557.057000000008,37427523.306000002,36877.146999999997,22720537.024000004,16933.13,8308498.6500000004,2864.4520000000002,3114132.7940000002,null,26648711.249499999,11381056.156000001]
["Rest of Europe",{"$f":"VLOOKUP(A35,Ref.Curr!A$1:D$58,4,FALSE)","v":"n/a"},15341.89,9775644.7500000019,52910.399000000005,78725175.530000001,132775.27800000002,87461674.87500003,115329.798,60013250.354000017,105315.12900000002,81963351.070000023,49953.186999999998,31485728.553000007,10137.736000000001,4289951.2639999995,null,58993936.377250016,39246343.629000008]
["Egypt",{"$f":"VLOOKUP(A36,Ref.Curr!A$1:D$58,4,FALSE)","v":"Arabic (official), English and French widely understood by educated classes"},1710.9090000000001,1250719.003,5602.9220000000005,7940810.7359999986,7621.3760000000002,18837167.236000001,11144.274000000001,15761673.463000003,12029.312,19085612.307000004,5476.795000000001,6467209.5789999999,4074.2969999999996,10061804.688999999,null,10947592.609500002,11871542.191666668]
["Morocco",{"$f":"VLOOKUP(A37,Ref.Curr!A$1:D$58,4,FALSE)","v":"Arabic (official), Berber dialects, French often used for business, government, and diplomacy"},461.21500000000003,468133.22500000003,1010.9390000000001,1295266.6950000001,9479.0769999999993,16799881.511999998,5879.2020000000011,7778880.7110000001,4404.1550000000007,7429711.9870000007,3844.8380000000002,9371953.2860000003,1282.0910000000001,500015.49,null,6585540.5357499998,5767226.9210000001]
["Tunisia",{"$f":"VLOOKUP(A38,Ref.Curr!A$1:D$58,4,FALSE)","v":"Arabic (official, commerce), French (commerce)"},461.21500000000003,683059.41500000004,972.90899999999999,263110.42499999999,734.23500000000001,2053096.9810000004,3259.384,1905182.149,2659.7540000000004,7405222.2219999991,409.79300000000001,211043.39499999999,null,null,null,1226112.2425000002,3808132.8084999993]
["Other North Africa",{"$f":"VLOOKUP(A39,Ref.Curr!A$1:D$58,4,FALSE)","v":"n/a"},1453.5029999999999,942174.005,1976.604,1086957.8570000001,10363.387000000001,14479827.267000001,8019.6630000000014,9338755.6420000009,4889.45,5772035.9379999992,1967.7,3646230.2000000007,null,null,null,6461928.6927500004,4709133.0690000001]
["South Africa",{"$f":"VLOOKUP(A40,Ref.Curr!A$1:D$58,4,FALSE)","v":"IsiZulu 23.8%, IsiXhosa 17.6%, Afrikaans 13.3%, Sepedi 9.4%, English 8.2%, Setswana 8.2%, Sesotho 7.9%, Xitsonga 4.4%, other 7.2%"},2209.5859999999998,1088709.9009999998,13950.413,6718760.8859999999,27835.493000000009,28277769.875999998,56627.159000000021,59171177.246000014,47706.777000000016,49913116.264999986,40981.754999999997,47329602.050000004,36379.794999999991,28702793.658,null,23814104.477250002,41981837.324333332]
["Nigeria",{"$f":"VLOOKUP(A41,Ref.Curr!A$1:D$58,4,FALSE)","v":"English (official), Hausa, Yoruba, Ibo, Fulani, and more than 200 others"},4540.3580000000002,4432962.301,5870.2420000000002,11892491.257999999,27153.074000000001,45585083.611000001,51175.691000000006,101603147.345,42461.195999999996,69019529.089000002,20390.036000000004,36146868.287,2555.0320000000002,4011709.8850000002,null,40878421.128749996,36392702.420333333]
["Other Africa",{"$f":"VLOOKUP(A42,Ref.Curr!A$1:D$58,4,FALSE)","v":"n/a"},3721.2639999999997,1369867.4580000001,4808.7580000000007,4047138.1679999991,24588.957999999999,29678544.697000004,37413.882000000012,40098521.223999999,38350.412999999986,51805945.138999999,22414.325999999994,25384320.526999999,13908.486000000001,12280968.291000003,null,18798517.886750001,29823744.652333334]
["Israel",{"$f":"VLOOKUP(A43,Ref.Curr!A$1:D$58,4,FALSE)","v":"Hebrew (official), Arabic, English"},5322.1390000000001,2789912.1470000003,13574.845000000003,5173556.55,27341.580000000005,14110248.390000001,45128.884999999995,30320048.061000004,27258.366999999998,21704518.695,19920.811000000002,11344055.128000002,18064.723999999998,7894172.0390000008,null,13098441.287,13647581.954000002]
["United Arab Emirates",{"$f":"VLOOKUP(A44,Ref.Curr!A$1:D$58,4,FALSE)","v":"Arabic (official), Persian, English, Hindi, Urdu"},10261.827000000001,12452034.549999999,19867.226999999995,51876354.360999994,69301.635999999969,172358105.48599997,77527.071000000011,128834445.20400003,53297.090999999986,122110351.54500003,27428.727999999999,34366196.197000004,4628.9950000000008,4619391.7249999996,null,91380234.900249988,53698646.489000015]
["Other Middle East",{"$f":"VLOOKUP(A45,Ref.Curr!A$1:D$58,4,FALSE)","v":"n/a"},15896.661999999998,24497691.634999998,37198.770000000011,137934094.391,97108.162000000011,322566898.94899994,93693.150000000023,222365827.13000008,95061.833000000028,327723214.87400007,33426.413000000008,77824748.568000019,6154.84,16035622.557000004,null,176841128.02625,140527861.99966669]
["Hong Kong (China)",{"$f":"VLOOKUP(A46,Ref.Curr!A$1:D$58,4,FALSE)","v":"Yue (Cantonese), English"},3289.4419999999996,3568321.8770000003,16070.565999999999,16675752.655999999,31688.883999999998,44065708.851999983,41889.696000000004,58416886.618000001,43861.713000000011,85902383.840000004,19284.251,36338888.816000007,6897.01,3131196.6549999998,null,30681667.500749998,41790823.103666671]
["Other China",{"$f":"VLOOKUP(A47,Ref.Curr!A$1:D$58,4,FALSE)","v":"n/a"},12932.982000000002,23381491.652000003,30714.550000000003,148081876.29700002,67353.150000000009,168270262.59,53312.102000000021,78096569.849000022,48786.825999999994,85427121.442000002,14679.269000000002,21479898.074999999,3796.895,8515043.2570000011,null,104457550.09700002,38474020.924666665]
["India",{"$f":"VLOOKUP(A48,Ref.Curr!A$1:D$58,4,FALSE)","v":"Hindi 30%, English, Bengali, Gujarati, Kashmiri, Malayalam, Marathi, Oriya, Punjabi, Tamil, Telugu, Urdu, Kannada, Assamese, Sanskrit, Sindhi (all official); Hindi/Urdu; 1,600+ dialects"},6754.1360000000004,1941390.5670000003,35181.212999999996,44170994.976000004,68397.113000000012,192944275.17999992,99512.013999999981,90762977.856999949,68674.008000000002,64335653.81000001,58899.255000000012,32932807.438999996,37832.162000000011,13614182.657000002,null,82454909.644999966,36960881.302000009]
["Japan",{"$f":"VLOOKUP(A49,Ref.Curr!A$1:D$58,4,FALSE)","v":"Japanese"},5600.206000000001,8945065.0370000005,33443.614999999998,44160097.489999995,44189.472000000002,29710784.246000007,48898.195999999996,48100034.552000001,49073.331999999995,42016331.787999995,25559.576000000001,25160288.973999999,13008.741999999998,9415881.102,null,32728995.331250001,25530833.954666663]
["Pakistan",{"$f":"VLOOKUP(A50,Ref.Curr!A$1:D$58,4,FALSE)","v":"Urdu 8%, English (both official); Punjabi 48%, Sindhi 12%, Siraiki (a Punjabi variant) 10%, Pashtu 8%, Balochi 3%, Hindko 2%, Brahui 1%, Burushaski, and others 8%"},2162.0300000000002,2159071.1120000002,6878.1149999999998,8153740.3740000017,7833.4280000000017,15320790.056,16106.556,26192193.583000001,16428.493999999999,32074157.132000003,8516.8080000000009,15727096.339000002,5042.2080000000005,15433568.210000001,null,12956448.78125,21078273.893666666]
["Sri Lanka",{"$f":"VLOOKUP(A51,Ref.Curr!A$1:D$58,4,FALSE)","v":"Sinhala 74% (official and national), Tamil 18% (national), other 8%; English is commonly used in government and spoken competently by about 10%"},null,null,1266.6510000000001,1863224.145,2554.0300000000002,987636.35900000005,5296.7349999999997,5077645.5040000007,7029.0729999999994,3566096.4400000004,6001.6220000000003,4239566.3040000005,2280.1620000000003,1927059.4240000001,null,2642835.3360000006,3244240.7226666673]
["Thailand",{"$f":"VLOOKUP(A52,Ref.Curr!A$1:D$58,4,FALSE)","v":"Thai (Siamese), English (secondary language of the elite), ethnic and regional dialects"},758.899,1117972.9469999999,4682.1020000000008,16469911.988999996,19512.811999999998,18640457.685000002,19312.490999999998,23854331.692000002,14029.916999999999,17853632.561000001,10251.122000000001,30006038.229000006,5536.741,8075965.7029999997,null,15020668.57825,18645212.164333336]
["Other Asia",{"$f":"VLOOKUP(A53,Ref.Curr!A$1:D$58,4,FALSE)","v":"n/a"},14928.103999999998,11092183.560999999,87826.003000000012,158192356.96700004,150154.948,144329513.53500009,149196.51300000006,171274366.76599994,144538.0420000001,225966387.30399999,70771.202000000005,83499943.274999976,19133.117999999995,21260400.871999998,null,121222105.20725,110242243.81699999]
["Australia",{"$f":"VLOOKUP(A54,Ref.Curr!A$1:D$58,4,FALSE)","v":"English 79%, native and other languages"},21333.246000000006,19979874.418000001,113544.951,101420985.596,208525.15600000002,219576071.48400006,168926.99000000002,154842582.34200004,213039.62800000008,250147009.50700009,199480.10100000008,269534891.53600001,144724.47200000001,177699967.477,null,123954878.46000001,232460622.84000003]
["New Zealand",{"$f":"VLOOKUP(A55,Ref.Curr!A$1:D$58,4,FALSE)","v":"English, Maori (both official)"},1777.8610000000001,324210.58500000008,7886.521999999999,5053612.7910000002,32945.565000000002,21559235.855,22679.405000000006,17677033.982000001,37388.161,35768997.947999999,35261.826000000001,30669045.667000007,28117.134999999998,25034446.391000006,null,11153523.30325,30490830.002000004]
["Barbados",{"$f":"VLOOKUP(A56,Ref.Curr!A$1:D$58,4,FALSE)","v":"English"},null,null,1451.546,384659.69,1304.1860000000001,1323748.79,1881.2090000000001,166489.81500000003,1698.6880000000001,2078848.9000000006,2657.7999999999997,2795887.1000000006,1138.8110000000001,136657.32,null,624966.09833333327,1670464.4400000004]
["Jamaica",{"$f":"VLOOKUP(A57,Ref.Curr!A$1:D$58,4,FALSE)","v":"English, Jamaican Creole"},null,null,null,null,null,null,3354.2580000000007,2222836.4720000001,2486.1170000000002,1342109.855,2999.88,1423719.55,958.78300000000002,302016.64500000002,null,2222836.4720000001,1022615.3500000001]
["Other Caribbean",{"$f":"VLOOKUP(A58,Ref.Curr!A$1:D$58,4,FALSE)","v":"n/a"},null,0,2151.7159999999999,1252626.0719999999,13684.149000000001,12710751.687000001,11264.981,12833236.975000001,16579.965,20281406.655000001,17071.709000000003,13587354.750000002,8337.840000000002,5241265.1150000002,null,6699153.6835000012,13036675.506666668]
["Brazil",{"$f":"VLOOKUP(A59,Ref.Curr!A$1:D$58,4,FALSE)","v":"Portuguese (official), Spanish, English, French"},3664.0030000000006,3097123.3330000001,43189.474000000009,50253931.009000011,59097.111000000019,73530257.34300001,54205.765000000014,58931615.403000012,53257.645999999993,44019157.887000002,34206.379999999997,33964148.863000005,9566.869999999999,13049525.521,null,46453231.772000007,30344277.423666667]
["Mexico",{"$f":"VLOOKUP(A60,Ref.Curr!A$1:D$58,4,FALSE)","v":"Spanish, various Mayan, Nahuatl, and other regional indigenous languages"},947.33400000000017,412170.34800000006,19020.359999999997,12898948.596999999,19461.113000000001,12670942.159,20232.327999999994,14062646.175000001,22976.995999999999,11263575.615,17727.761000000002,6925806.9420000017,7269.2539999999999,2406751.3829999994,null,10011176.81975,6865377.9800000014]
["Other Central & Sth. America",{"$f":"VLOOKUP(A61,Ref.Curr!A$1:D$58,4,FALSE)","v":"n/a"},7788.9420000000009,3682040.3250000007,28163.736000000001,26466837.175999999,49339.77900000001,37043435.564000003,42597.292999999998,30130467.599999998,60180.688000000002,60946717.748999991,53029.025000000001,27287040.046000004,14862.67,8997875.0080000013,null,24330695.166249998,32410544.267666664]
["Rest of the World",{"$f":"VLOOKUP(A62,Ref.Curr!A$1:D$58,4,FALSE)","v":"n/a"},null,null,null,null,1201.768,673953.07000000007,1403.7510000000002,521267.99900000007,2808.0059999999999,2339942.94,5947.1769999999988,6146682.0650000004,null,null,null,597610.53450000007,4243312.5025000004]
[]
["Totals",null,{"$f":"SUM(C6:C62)","v":1394778.9624450759},{"$f":"SUM(D6:D62)","v":644471465.69804609},3755867.7947513512,2775846334.5987554,6883615.5247927196,4433663187.9747763,7484565.3356740829,4403366169.1172075,7149132.7782589411,4759948139.2954369,4063385.5111508584,2605666163.6829424,2060139.0669269732,{"$f":"SUM(P6:P62)","v":1271131713.8538363},null,{"$f":"AVERAGE(R6:R62)","v":53809117.058368944},{"$f":"AVERAGE(S6:S62)","v":50581909.913521744}]
[]
[]
[]
[null,"Age Group","0-15","16-24","25-34","35-44","45-54","55-64","65+"]
[null,"Total Visitors",1394778.9624450759,3755867.7947513512,6883615.5247927196,7484565.3356740829,7149132.7782589411,4063385.5111508584,2060139.0669269732]

{"sheet":"Dest.","index":4,"n_rows":92,"n_cols":5,"rows_kept":92,"cut":false,"hidden":true,"merged":[[1,0,1,4]]}
[]
["Destinations and Purposes of Visitors"]
["Destination","Holiday","Business","Personal","Other"]
["Bedfordshire",41571.003689869671,80816.865443242976,116039.25973659428,25606.12641708658]
["Berkshire",138544.11706688069,184148.9245711618,191237.95462571087,34198.232907294718]
["Bristol UA",142990.30451997774,103581.24804354533,156251.74812277648,25423.943219323814]
["Buckinghamshire",52444.911939341837,111477.07162100157,128961.16929230292,13770.333446029288]
["Cambridgeshire",152723.18060323806,146969.2791201463,211185.17375788034,46166.232444438698]
["Cheshire",70948.127677554134,74223.374783915293,142325.28487213203,16048.147342751221]
["Cornwall",217217.93133379691,14370.501348583728,84973.967261560858,2932.7553886041601]
["Cumbria",123180.2500166362,27469.409746118119,80336.67766736036,6691.3877665618338]
["Derbyshire",57344.876699634478,62804.147886012608,71448.411534349289,4693.543039938636]
["Devon",267013.46882121504,57162.055604968162,166550.2698001744,45230.837200575981]
["Dorset",136948.41318394264,32090.315614089483,159846.13289008421,27240.096914636077]
["Durham",30069.183188451752,26970.969776472029,19989.107636652167,3531.389486016003]
["East Sussex",352953.92974801181,64494.090310566564,211769.87311470701,60752.123712028755]
["East Yorkshire",9029.2816567053269,2898.4191843346575,17068.558151508005,1046.3501479100034]
["Essex",105411.59032805092,98634.661849115888,199280.03825427612,35448.629358225087]
["Gloucestershire",97482.873199169393,39617.954539959319,101788.68950996407,12499.255002649661]
["Hampshire",186961.69305213643,170530.87734220451,284572.17821414262,46822.524520031293]
["Hereford/Worcs",41000.345545598822,32426.272073666085,66178.157894880147,8093.295414889214]
["Hertfordshire",94796.333253670935,81181.615426706747,201569.19463506216,23503.172546612172]
["Hull UA",7044.5154020542559,21155.175418322044,33503.779471851492,618.93871260739502]
["Isle of Wight",27137.347379091225,1917.341331001601,17848.455467017102,1539.1463216668315]
["Kent",412279.78270591929,263949.58234801679,275996.3891861423,76019.441292826494]
["Lancashire",57221.440882046518,64287.903880363599,112173.35399115529,19280.726018468613]
["Leicestershire",34372.791260230093,74139.643988552984,96924.764021840441,13799.994387095938]
["Lincolnshire",49234.507930475353,49224.520213015094,90779.682204323675,3461.2966662448753]
["London",8501466.3783140797,3239421.2602912164,3773352.8200072385,1269908.2313004704]
["Greater Manchester",248320.41452089226,361058.57240428298,367967.79095720494,193293.09059678108]
["Merseyside",201825.49061671612,137838.78315820952,176896.5867942241,107443.86421853787]
["Norfolk",48332.358033943943,28528.83793273539,93153.962464496275,7063.1467919921515]
["Northamptonshire",28989.546118607461,91878.785268257576,90632.512137882368,23809.158379007382]
["Northumberland",22559.072483336233,1265.5026765448629,23206.829680981889,642.73500000000092]
["North Yorkshire",199920.7944357252,65443.446432195713,122501.05956977329,17343.680218103887]
["Nottinghamshire",54673.53206701696,99766.852422867392,120519.04404791752,25388.338900261588]
["Oxfordshire",212892.54001153371,162351.65088979906,168496.10489087575,53269.234003177116]
["Shropshire",38630.668717930559,16641.643425420069,57193.407708320032,2962.4079007261607]
["Somerset",269832.75199816271,36390.101139431674,168015.59914593646,21887.365494156642]
["South Yorkshire",33047.185111552171,94480.442155140583,107847.15418803639,20511.866237034203]
["Staffordshire",42720.889042162176,57209.734027552528,76415.336432275479,8703.7615669307506]
["Surrey",121420.7541031983,100327.73595986965,273048.79096268991,23386.455976124857]
["Suffolk",72505.516370630183,59215.779087259682,87209.09472284856,11622.369520212136]
["Tees Valley",10307.282726185391,8338.632434629706,35169.043022951904,1284.570324391364]
["Tyne & Wear",74892.798320296803,72098.529174855052,92751.007973881147,12389.879098751609]
["Warwickshire",94156.196387238349,73850.990314044291,78237.117506081398,17510.819975757226]
["West Midlands",211388.96524640534,553624.73246942239,353885.06828391907,83316.318257770399]
["West Sussex",121433.229829645,93775.789336668749,152240.44346520645,125059.77196922999]
["West Yorkshire",80850.659205105097,164479.01422845505,188354.45291741949,32117.999646401287]
["Wiltshire",114484.80967018651,44249.102443091615,83553.424206086609,6450.656285152133]
["England unspecified",327.12965040350326]
["Argyle",103146.5200719502,1765.3219698098189,23126.786383784056,464.44890096646003]
["Borders",25284.51294280501,1495.814562662069,15783.6759750493]
["Central",84565.794168222506,1977.7843101861552,40405.778909052955,1507.3514443101496]
["Dumfries & Galloway",19169.490080945478,7238.9964418540148,13373.366502959167,272.48400000000015]
["Fife",74493.504600705812,13111.51076078707,59010.910101016932,2406.5574607336794]
["Grampian",119195.8399207102,133712.2793451405,56967.294819903182,7790.5006664843349]
["Greater Glasgow",285006.15072395356,91996.467477703496,209112.4069818189,26482.042678510719]
["Highlands",346384.18086872844,8724.5484695855466,51123.021249785837,3234.1103574119375]
["Islands",148525.30940072358,5857.1487189545178,13153.962304347126,580.22800000000279]
["Lothian",855653.77265616891,142050.82389383204,300795.41839445318,56526.978926440788]
["Strathclyde",51353.816764574825,3289.7929297848746,31184.853889585997,855.99869380922883]
["Tayside",136810.25391263139,23864.201836484226,75159.051515834901,2151.519434211802]
["Scotland unspecified",12335.212203063093,1812.6393912873377,1058.6542123115159,1683.5689732433264]
["Aberconwy/Colwyn",32020.407077492182,1510.7069365783477,15345.453109852695,2144.9106835524135]
["Anglesey",15255.289885596361,8293.3338399907152,14784.394166630944,1324.3993140881857]
["Blaenau Gwent",1141.1871699813707,424.7817837785451,1512.8639999999975]
["Bridgend",7294.4071736890801,2999.1308787643857,13564.024077731436,349.67960797343812]
["Caernarfonshire/Meirionnydd",34458.938641565495,4487.3783996716766,25477.429278512125,2661.311396927304]
["Caerphilly",3299.9792237912106,2734.2359999999908,5210.5267906621457]
["Cardiff",128888.5331895479,71446.821409287702,73945.343635871424,24077.692772282015]
["Cardiganshire",15197.739480164981,1673.2926529332444,7139.516451149575,1584.5286418135695]
["Carmarthenshire",17490.616766508061,12451.947519471039,7726.521016165384,1028.8093075481872]
["Denbighshire",14192.21133393834,null,10591.004954259424,3695.6848423190554]
["Flintshire",3931.2710557893001,2637.2328739453105,9234.5596375901932]
["Merthyr Tydfil",3058.9016217632707,1308.041725885638,1808.9813382162001,327.83904557396215]
["Monmouthshire",17364.486804871536,1720.4980689674142,14893.02795295653]
["Neath/Port Talbot",1211.0313685158869,null,5511.6689665059539,311.87565236683298]
["Newport",11633.884124705159,21140.740703507669,16543.602523606456,2947.3618276806014]
["Pembrokeshire",55289.767548408687,6237.8562471355363,12172.536340847191,6239.4403027456001]
["Powys",18044.594103159063,3028.2600317567872,16210.165151508252,584.7555855276164]
["Rhondda",1981.3196808578812,464.62499499176965,3002.7152352463504]
["Swansea",30044.564713850381,12454.486873381551,35868.556321067124,3315.2062539414201]
["Torfaen",null,1355.4119999999966,1530.8845928911446,300.12599999999594]
["Vale of Glamorgan",2234.7361951701664,1733.2323393449794,5021.3974464954345]
["Wrexham",2378.942955677483,8362.9519074672316,17804.121764623575,2057.9534754482124]
["Wales unspecified",9976.9247391944809,1458.6195373656265,892.78064844775292]
["Northern Ireland",102636.63012227416,69778.667979362493,145786.11728217456,47443.870569783991]
["Nights spent Travelling",19570.723788150688,58832.08548689985,3058.7053490855719,29544.891561686698]
["Isle Of Man",3995.1334983538445,966.07663833976392,6692.4997521453879,831.75600000000202]
["Channel Islands",2171.5543621720117,null,3564.2626799391751,893.28700000000424]
["UK area unknown",26581.13934223284,5371.009033697168,11683.414245305821,642.73500000000092]

{"sheet":"Quarter","index":5,"n_rows":23,"n_cols":15,"rows_kept":23,"cut":false,"hidden":false,"merged":[[1,0,1,8],[2,0,3,0],[2,1,2,2],[2,3,2,4],[2,5,2,6],[2,7,2,8]]}
[]
["2013: Visits to and spending in UK; by residence, quarter, and purpose of visit"]
["Nationality","January - March",null,"April - June",null,"July - September",null,"October - December"]
[null,"Visits","Spending","Visits","Spending","Visits","Spending","Visits","Spending",null,null,"Jan-Mar","Apr-Jun","Jul-Sep","Oct-Dec"]
["North America",null,null,null,null,null,null,null,null,null,"Holiday",152686.21380000014,270210.96339999902,291482.61389999982,1934933.1069999996]
["Holiday",14492.818299999995,114203465.94199999,44457.725600000085,350402405.75699991,60339.139200000136,553832425.35600019,209877.47600000011,181459184.86600009,null,"Business",149907.62140000006,165765.85819999996,144108.5674,1718076.2159999998]
["Business",19083.028599999998,220724428.699,22260.095800000006,315140177.13199991,19510.554300000003,248208557.78700018,204123.25200000015,232810766.03900003,null,"Personal",144164.64410000035,166419.01699999991,173068.67900000044,1853579.7989999999]
["Personal",16894.658300000014,79447275.299999967,25069.042600000033,157691522.92200005,33765.035000000011,212059359.54399994,225515.2249999998,123314835.46500002,null,"Miscellaneous",39080.936999999976,51475.193100000026,55265.819400000008,551644.9369999998]
["Miscellaneous",6648.3471000000009,49438573.772000007,9096.2060999999994,49046335.880000025,11368.336300000003,80823902.972000018,64996.12,104348143.023]
["All visits",57118.852299999948,464694178.11499989,100883.0701,875253744.05400014,124983.06479999972,1097338967.0009985,704512.07300000102,643423245.07199943]
["Europe"]
["Purpose","Q1",1,"Q2",2,"Q3",3,"Q4",4]
["Holiday",152686.21380000014,691446794.08700025,270210.96339999902,1249124340.9350023,291482.61389999982,1669687314.2119994,1934933.1069999996,879074324.78500068]
["Business",149907.62140000006,569065676.09799957,165765.85819999996,621170150.17299962,144108.5674,600477842.03099966,1718076.2159999998,821122739.08099949]
["Personal",144164.64410000035,460007688.16300017,166419.01699999991,489123345.1050002,173068.67900000044,644390073.25599992,1853579.7989999999,570343344.88299966]
["Miscellaneous",39080.936999999976,248939888.15600017,51475.193100000026,354419373.10100019,55265.819400000008,509029087.19200009,551644.9369999998,482465953.4950003]
["All visits",485839.41629999899,1971691262.3899989,653871.03169999958,2717870981.6560049,663925.6796999994,3455618542.0559969,6058234.0589999603,2756951703.9459968]
["Other Countries"]
["Holiday",33045.668600000034,449549425.39900017,60231.679000000091,639010762.21500003,92000.263099999967,1092687894.6679995,391927.72300000023,577760688.52399993]
["Business",16701.202600000001,261171661.51000008,23834.449899999989,399161706.30300009,20899.102199999998,409012295.47799981,202427.35800000001,316128043.98200017]
["Personal",30912.716400000034,293406944.09900022,37862.690500000048,438988443.86100036,59660.771700000041,646574399.15900028,369502.16900000046,408833140.41999996]
["Miscellaneous",9672.2426999999989,147993726.76500002,10219.792200000004,219327776.69099998,16677.905100000004,486788266.07799989,103238.61800000005,229860511.51699996]
["All visits",90331.830299999972,1154606295.2499988,132148.61160000015,1701370612.5560012,189238.04210000017,2637449235.1900067,1067095.8680000009,1535958510.9489992]

{"sheet":"Visit Length","index":6,"n_rows":63,"n_cols":15,"rows_kept":63,"cut":false,"hidden":true,"merged":[[2,1,2,14],[1,0,1,14],[2,0,4,0],[3,13,3,14],[3,1,3,2],[3,3,3,4],[3,5,3,6],[3,7,3,8],[3,9,3,10],[3,11,3,12]]}
[]
["Visits to and spending in UK: by length of stay and country of residence 2013"]
["Nationality","Time"]
[null,0,null,"1-3 nights",null,"4-13 nights",null,"14-27 nights",null,"28-90 nights",null,"3-6 months",null,"6-12 months"]
[null,"Visits","Spending","Visits","Spending","Visits","Spending","Visits","Spending","Visits","Spending","Visits","Spending","Visits","Spending"]
["Canada",3848.268,2614675.9510000004,190928.38300000009,70839625.263000056,382753.72399999981,273178402.80499989,124345.56300000002,123061622.28700003,38272.947000000015,45962525.540000014,1882.0410000000002,8982714.1840000004,1826.7190000000001,8368818.8350000009]
["USA",31976.12,8731376.415000001,936273.62200000021,456512073.75999951,1435515.7649999992,1464045644.9840024,291328.18100000004,395695299.02599984,80648.856,154727657.37800005,12997.731,60798121.364,1764.0250000000001,7191576.4500000002]
["Austria",6606.8460000000023,1052612.9380000001,110456.75400000002,41748732.664000012,136744.93600000005,75652195.589999989,19566.073,20241611.836000007,1754.6189999999999,2993908.335]
["Belgium",166193.49500000008,13282341.077,726761.55600000045,220785056.8719998,270090.12500000012,135545302.93999997,17470.772999999997,9104194.6230000015,6972.92,6857915.1180000007,833.13100000000009,249939.30000000002]
["Bulgaria",3522.893,97452.434999999998,67549.082999999999,15809755.890000001,39734.744999999988,21005581.371999998,7937.9460000000008,5103749.97,6576.1559999999999,4556106.87,680.88400000000001,3599152.824,461.714,191611.31]
["Czech Republic",5660.3280000000004,657571.6,136549.86299999995,25080285.338000003,170250.87800000006,61363836.76000002,23475.677,11193235.522000002,18196.624,12441833.335000001,3685.3,6668834.0530000003,661.62599999999998,4869567.3599999994]
["Cyprus",null,null,21449.268000000004,10301964.658,72269.305999999982,68456549.192000002,22744.202999999998,19402042.618999999,5441.6270000000004,6889599.2050000001,367.25900000000001,187302.09,1005.722,17443242.368000001]
["Denmark",36456.452000000005,2933596.8679999993,325735.24,145659629.77400005,315682.97400000028,228570469.17800006,19412.384000000005,44876729.571999997,4217.6040000000003,10694649.881999999,1233.7280000000001,7145752.5760000004]
["Finland",5011.2790000000005,1085750.9410000001,78760.227999999959,36390276.325000025,113910.96100000002,66158374.592,13464.141,11576661.147,3653.5349999999999,4432129.7369999997,null,null,349.68100000000004,131829.73700000002]
["France",483104.68199999991,32834923.439000007,1808908.5090000017,501984844.04399979,1399136.0530000012,586808890.70100045,168668.59299999996,105864128.175,60745.447000000036,88691844.072999999,9832.6540000000005,33378917.360999998]
["Germany",191200.31700000007,20635291.128000002,1313356.5959999983,403625728.96500039,1364805.8559999985,667158222.9139998,240736.05500000014,177358515.35700002,39345.749000000018,73434363.133000001,10852.337000000001,53489181.568999998,1683.2449999999999,12305435.671]
["Greece",1034.634,457155.21299999999,48236.165999999997,23375977.229999997,103424.36899999999,73901084.990999997,16802.420999999998,19231131.943000007,7193.0349999999999,22291193.859999999,1047.5309999999999,7336869.8849999998]
["Hungary",5586.058,254779.15699999998,155400.36900000001,16181267.433999995,99843.070999999953,29013658.789999999,11734.17,4880127.6889999993,4422.8950000000004,3243545.6029999997,2710.4470000000001,17067272.373999998,857.85400000000004,4838296.5600000005]
["Irish Republic",244528.55300000007,57602627.537,1335301.0529999984,405143128.88599968,718812.87599999981,288989511.78800005,73783.842999999979,39937313.375999987,16435.620999999999,13870325.284,5651.3629999999994,12000260.703]
["Italy",41327.019000000015,5235858.5730000008,646000.6170000002,208595327.29099983,823142.90599999914,407364981.66600001,104327.65500000001,87982393.310000002,42970.101999999999,74345677.236000001,7363.3450000000003,38819059.824000008,676.15800000000002,8034785.5140000014]
["Lithuania",2062.5079999999998,194214.70900000003,84898.633000000002,14287109.431000002,96354.825999999986,27417886.062999994,13921.282000000001,3727595.1199999996,6866.2230000000009,11865309.775,108.93900000000001,621714.87300000002,733.28500000000008,8020671.330000001]
["Luxembourg",6815.5159999999996,404200.67200000002,52088.864999999998,26144950.088000003,29904.494999999995,15111895.958000001,2404.7110000000002,1421037.925,606.72500000000002,919188.375]
["Malta",1255.2180000000001,542930.62100000004,24843.136999999999,9211856.2959999982,48226.097000000023,29530021.076000005,6601.469000000001,3095583.0989999999,2505.1279999999997,5437716.7200000007,1009.42,5062241.3000000007]
["Netherlands",173966.79100000008,15758786.796999998,991791.31900000235,294874528.65999985,618741.93200000026,288152069.69800013,120073.08399999996,88284211.203000039,16002.986000000003,28517232.110000003,1365.4380000000001,4856801.97]
["Norway",28204.922000000002,4721951.9589999989,449916.4989999996,265654839.37499994,339811.93499999988,241605888.82600001,26555.079999999998,16405767.750999998,3849.8230000000003,5381433.5989999995,1876.4180000000001,3090653.87]
["Poland",35076.988000000005,4297064.5839999998,607256.39400000009,85766108.629000023,477979.22200000018,147335337.96199998,159632.40500000006,66732813.330000013,65729.664999999979,73939920.313000008,7373.42,32578659.669000003,3960.2810000000004,38697770.847000003]
["Portugal",9862.0250000000015,681816.99700000009,111363.06799999997,29468039.976000007,128331.77799999996,54960014.068000026,26953.844999999998,17472969.815000001,7704.8909999999996,8013817.7850000001,1456.9570000000001,4348136.8400000008]
["Romania",17193.269999999997,530960.52400000009,194775.804,24987752.914000008,112713.37000000005,64042765.053000011,25532.188999999998,19504644.466000002,30026.642,24614880.080000002,4778.2700000000004,19317750.254000004,680.88400000000001,5662912.2280000001]
["Russia",1591.3230000000001,474085.58500000002,61160.974999999999,50386825.186999999,104778.99999999997,125922398.33800006,36024.854000000014,55767191.173000008,8982.6869999999999,22609971.640000001,1241.116,2352344.7400000002]
["Slovakia",4010.1770000000006,74297.614000000001,77965.755999999979,10136976.117999997,50287.267999999982,15846840.492000004,6079.2520000000004,1411522.6800000002,8496.5370000000003,7525394.2660000008,879.93100000000004,527958.6]
["Spain",28498.848000000002,2469037.8280000011,628492.48799999943,251832984.83400002,810145.41800000006,351529242.47299999,136738.26900000003,103791721.582,88033.76,154251288.10600001,10907.514000000001,33137266.575999994,1659.3070000000002,8206473.8049999997]
["Sweden",21833.209999999995,3868425.1190000009,412567.78800000006,197508548.94799995,324082.77900000004,194538912.64999995,15606.917000000003,10273989.030999999,17804.398999999998,31966829.042000007,1234.0150000000001,7100589.5450000009,1166.01,1883106.15]
["Switzerland",40077.771999999997,4283674.1059999997,423934.93700000027,198109655.55600005,292155.97500000009,224779092.43899995,47693.588000000003,45632721.675999992,10214.191000000001,14523488.658,1692.336,16170168.040000001]
["Turkey",665.47500000000002,68502.06,44506.034000000021,25082204.568,79642.016999999993,72076695.322000012,19992.075999999997,20581861.036000002,7565.4080000000004,11289006.896,1815.4770000000001,11801480.865]
["Rest of Europe",6126.4070000000002,1204424.6270000003,196743.62400000001,59480207.554999992,207222.63500000007,138118606.71700001,41498.351000000002,46948186.847999997,21921.272999999994,50237875.023000002,5816.2040000000006,26413270.469000004,2747.125,31408987.777000003]
["Europe",1567473.0060000033,175794652.17299989,11136770.622999975,3597614563.5059991,9348227.8029999919,4700956327.6089869,1425431.3060000029,1057803651.8740003,514236.27199999976,775836444.05899966,85813.433999999994,347321580.16999996,16642.892,141694690.65700001]
["Egypt",null,null,7618.0339999999997,7318054.2440000027,29760.02399999999,48794516.178999998,5964.3189999999995,9749142.568,4317.5079999999998,13543284.021999998]
["Morocco",null,null,5035.951,4008840.2229999998,14908.878000000001,17620645.241999995,3048.877,3825749.1720000003,3367.8110000000001,18188608.269000001]
["Tunisia",null,null,2360.826,527392.57900000003,3929.125,5156661.7769999998,1473.104,4783563.25,734.23500000000001,2053096.9809999999]
["Other North Africa",null,null,5312.2270000000008,4040135.2849999997,10883.836000000001,14791953.773,7875.4480000000003,9834292.8890000004,3182.8840000000005,814714.67500000005,958.51200000000006,5191300.9920000006,457.40000000000003,578611]
["South Africa",2735.2759999999998,2731261.4019999984,44077.606000000007,26743017.863999996,105961.77599999995,117494322.12599997,50685.302000000018,45796041.370000005,20313.537000000004,27805644.655000001,2073.5360000000001,870332.04,318.58500000000004,148142.02500000002]
["Nigeria",1007.7370000000001,2086116.2960000001,29313.510999999995,29608446.057000004,75173.853000000017,129092267.14000002,37107.224000000009,84874336.069000006,10406.707000000002,23045143.635000002,1136.597,3985482.5790000004]
["Other Africa",983.21600000000001,2129196.8220000002,25181.009999999995,11506368.005000003,65818.041000000027,78609456.051000029,32651.560999999994,44949690.444999993,17848.716999999997,14695852.545000002,2723.5419999999999,12774741.636000002]
["Israel",1182.3600000000001,742609.32799999998,49139.766999999985,24313439.323000003,99182.396999999983,64307304.110999994,6632.5260000000007,3088619.1520000002,2097.1459999999997,1942634.0360000001]
["United Arab Emirates",1921.2959999999998,528433.0959999999,43868.346000000034,38925453.639999978,138483.95700000008,243647839.25899997,52150.892999999989,139866123.05399993,24001.606000000011,91877675.804999992,1672.0060000000001,11053305.306000002,214.471,718048.90800000005]
["Other Middle East",424.61500000000001,1359501.76,59505.059000000016,61544024.959000021,185927.42600000018,446986311.14300013,77816.635000000024,301319099.76300007,44180.226000000002,181726084.22700003,9402.1610000000001,118378252.63200003,1283.7080000000001,17634823.620000001]
["Hong Kong (China)",null,null,40654.592000000004,33771205.991999999,80192.639000000068,130722733.45899996,28006.033000000003,56829755.002999999,13825.572000000002,26368890.194000006,635.62599999999998,1180421.5220000001]
["Other China",null,null,44188.347000000009,42225389.125000007,118624.64400000001,182926745.81899995,40265.574000000001,91160939.623000011,18466.503000000001,63067142.013999999,4598.8100000000004,31819246.078000002,6527.472999999999,123763479.51800001]
["India",1144.347,375107.95699999999,106811.70600000003,39957151.24400001,140917.17000000007,109566624.759,52571.208999999988,61474056.213000022,45187.958999999995,69500751.173000008,18464.444,36940279.81000001,10153.066000000001,122888311.33000001]
["Japan",3292.5219999999999,467729.929,76500.572000000015,33791081.258000001,106573.113,100515580.12500001,16337.844000000005,21317974.860999998,15621.241000000004,29253325.609000001,2071.444,19950081.681000002,308.77699999999999,3053804.53]
["Pakistan",null,null,5518.7690000000002,2880367.537,23328.054999999997,36856671.907000005,17450.023999999994,42263146.516000003,13631.689999999999,23119124.090999998,2734.2850000000003,7127260.3670000006,304.81600000000003,2811317.9680000003]
["Sri Lanka",null,null,2361.7470000000003,1298250.355,9249.3630000000012,6293790.8380000014,8227.6049999999996,6645801.6580000008,3698.4919999999997,3377920.91,891.06600000000003,45464.415000000001]
["Thailand",733.99599999999998,389823.56999999995,8638.4120000000003,6378795.1800000006,43271.636999999981,74012084.131999999,15497.175999999999,17030516.240000002,5335.0969999999998,7022077.7549999999,708.43100000000004,766892.06499999994,366.99799999999999,11382442.969999999]
["Other Asia",8815.1939999999995,12099135.843,204913.64800000016,90644554.911000013,293274.77200000017,399532313.17499995,84350.339999999982,137892843.37400007,30733.483000000007,44112196.321999989,11538.463,103444712.79700001,3236.2300000000005,28431076.658]
["Australia",4686.5,3555596.0410000007,221813.60400000011,75902744.943999991,456926.44899999973,430049156.85000002,243452.85400000005,341750750.12299985,137477.46000000008,289355267.74599999,3909.2220000000007,16841108.331000004,1696.1020000000001,36334043.530000001]
["New Zealand",1237.2350000000001,98826.171999999991,39785.807000000001,16240521.539999995,65094.152000000024,46725824.274000019,40529.191999999995,43473546.910999991,18577.302999999996,25801429.032000005,null,null,832.78600000000006,3746435.29]
["Barbados",null,null,3020.0200000000004,303147.13500000001,616.85599999999999,194309.63999999998,2386.018,2353006.41,3837.5640000000003,3888299.9600000004,null,null,271.78200000000004,139967.73000000001]
["Jamaica",null,null,null,null,2097.5940000000001,1868863.5619999999,1451.546,312082.39,5111.0870000000004,2523248.9050000003,1138.8110000000001,586487.66500000004]
["Other Caribbean",384.13200000000001,168964.27599999998,19304.985000000004,13974588.182000004,25407.321000000007,22398594.128000002,14685.922000000002,17605143.511999998,8273.4290000000001,11019632.890999999,1034.5710000000001,739718.26500000013]
["Brazil",5474.8090000000002,692744.33799999999,74579.522999999986,34610886.228000008,143221.07399999999,146074345.27699995,18606.113999999994,43765876.886000015,12560.814000000002,38760411.654999994,2744.915,12941494.975000001]
["Mexico",1960.5490000000002,294734.05599999998,51742.224000000009,14553410.397000004,41600.275999999998,31927378.218999997,9650.747000000003,11248160.297000002,2756.8610000000003,2666014.875,475.71300000000002,863419.09500000009]
["Other Central & Sth. America",4469.1940000000004,700056.73900000018,101559.97100000001,37718572.359000012,118123.58299999996,94500626.118000001,19224.344999999998,21934693.839000002,11032.382000000001,29734352.603000008,1552.6579999999999,9966111.8099999987]
["Rest of the World",null,null,2293.9870000000001,773358.35499999998,6945.067,4091688.9649999994,830.08500000000004,2725570.7749999999,1291.5630000000001,2091227.9790000001]

{"sheet":"(Air)ports","index":7,"n_rows":63,"n_cols":14,"rows_kept":63,"cut":false,"hidden":true,"merged":[[1,0,1,13],[2,0,4,0],[2,8,2,13],[3,8,4,8],[3,9,4,9],[3,10,4,10],[3,11,4,11],[3,12,4,12],[3,13,4,13],[3,5,3,7],[3,4,4,4],[3,2,4,2],[3,3,4,3],[3,1,4,1],[2,1,2,7]]}
[]
["Visits to the UK: by UK port  or airport and country of residence 2013"]
["Nationality","Airports",null,null,null,null,null,null,"Sea and Channel Tunnel"]
[null,"Heathrow","Gatwick","Manchester","Stansted","Other",null,null,"Dover seaports","Other channel ports","East coast ports","Long haul sea routes","Irish Sea & land routes","Channel Tunnel"]
[null,null,null,null,null,"England","Scotland","Wales"]
["Canada",372872.70099999936,120969.15899999997,41683.730000000003,8169.4190000000017,46778.625000000007,55883.778999999995,704.22700000000009,15427.534999999998,530.80500000000006,3051.7809999999999,658.7109999999999,15660.597000000003,61466.575999999994]
["USA",1811273.3890000011,137904.92899999995,135603.02000000011,48586.582000000024,129761.89200000005,177111.46199999994,6975.076,41144.976999999984,11228.268,7193.9800000000005,7646.1280000000033,32454.055000000004,243620.54200000054]
["Austria",105719.60200000003,32359.303000000004,16177.187,50245.36,21990.471999999994,34633.074000000001,null,7532.6370000000006,null,2224.087,null,null,4247.5060000000003]
["Belgium",50746.281999999985,1851.6180000000002,35286.527000000009,11302.375999999998,52466.635999999999,32239.354000000007,458.81300000000005,235924.64500000028,702.13900000000001,19762.886000000002,397.06900000000002,1705.421,745478.23400000157]
["Bulgaria",26910.21200000001,4137.3360000000002,3648.1160000000009,3047.5260000000003,33093.361999999986,null,null,43103.894,null,182.20500000000001,null,null,12340.77]
["Czech Republic",39224.81099999998,21467.601000000002,12349.716999999997,55654.928999999996,60041.841999999975,13411.481,null,91485.011000000028,null,160.10300000000001,201.38,null,64483.421000000024]
["Cyprus",38111.25499999999,29255.614000000005,16801.851999999995,16718.046999999999,15814.299999999997,1569.9450000000002,862.64800000000002,1119.731,569.14200000000005,null,null,null,2454.8510000000001]
["Denmark",125449.5020000002,192242.72500000001,58834.95299999995,159539.86200000014,46778.87799999999,47649.741000000009,456.358,21994.350000000002,null,41324.786000000007,null,3640.48,4826.7470000000003]
["Finland",96488.766000000003,62435.93700000002,21136.390999999996,14229.582,5512.5880000000006,9411.2899999999991,null,2239.462,null,960.85900000000004,null,null,2734.9500000000003]
["France",268428.17900000006,260612.77199999988,76307.786000000022,239275.02699999989,444019.20400000014,130013.8710000001,6759.8470000000007,459674.19100000151,307984.79399999999,7493.5779999999977,556.38,3734.0780000000004,1725536.2310000069]
["Germany",684504.78199999966,214759.55399999995,189600.90399999992,422433.72300000035,457362.72899999982,208832.29999999996,10072.098,614541.43400000024,1257.5590000000002,117394.60699999999,381.18,16062.008000000002,224777.27700000018]
["Greece",96939.577000000034,23016.123000000003,10812.874999999998,9832.9660000000003,11596.994999999999,16462.603999999996,null,5361.8690000000006,533.42100000000005,144.37800000000001,null,null,3037.348]
["Hungary",17584.610999999994,6274.3940000000002,7566.8200000000015,50824.995999999999,47721.72699999997,460.29200000000003,null,109842.19000000008,null,1345.2099999999998,null,null,38934.624000000011]
["Irish Republic",223736.2760000001,252942.78100000031,155534.24900000021,282286.7319999999,733257.65599999786,99207.585999999952,18385.538,26568.327999999998,1691.961,97.26700000000001,332.21,579737.44800000044,20735.276999999998]
["Italy",331321.5120000001,351063.17700000003,49208.551000000007,580403.10300000117,200690.36499999999,75003.277999999991,380.435,51391.111000000019,null,1603.327,null,877.58400000000006,23865.358999999997]
["Lithuania",4311.4940000000006,8827.2670000000016,455.66400000000004,43744.398999999998,60098.208999999973,734.86500000000001,null,65130.022000000012,null,1971.0710000000001,null,null,19672.704999999998]
["Luxembourg",6551.822000000001,6173.1530000000002,966.22800000000007,2049.8009999999999,44603.056000000011,1608.152,null,13191.772000000003,null,2266.6610000000005,null,null,14409.667000000005]
["Malta",25180.776000000013,19372.515999999996,8418.8010000000013,4323.0469999999996,24619.749000000003,669.26300000000003,449.91200000000003,1250.9570000000001,null,null,155.44800000000001]
["Netherlands",216567.46799999982,107750.24699999996,61216.514000000039,151422.74,412944.95600000012,109662.87500000017,7578.3449999999993,308495.30200000049,1848.9180000000003,205735.62000000008,null,5613.9989999999998,333104.56599999923]
["Norway",215609.63200000025,228746.32299999986,77395.289999999964,156734.09400000004,52150.536,109984.535,null,2196.7049999999999,null,1974.3240000000003,null,906.00900000000001,4517.2290000000003]
["Poland",55992.063000000002,3137.1489999999999,23876.00399999999,277482.40299999999,372789.24600000028,52340.760000000009,null,417565.69499999995,null,827.47300000000007,null,1172.2950000000001,151825.28699999987]
["Portugal",75142.330000000045,63655.088000000003,9830.0919999999987,37398.137999999999,60561.130999999994,3676.4830000000002,null,27474.587,353.38100000000003,779.52,null,null,6801.8140000000003]
["Romania",42229.434000000008,2555.7940000000003,3283.9900000000002,3885.462,112934.80000000008,9407.5279999999984,null,168133.85499999995,null,107.61800000000001,null,943.53200000000004,42218.416000000012]
["Russia",147383.23400000017,26769.563000000006,8021.9620000000004,3154.48,3851.8790000000004,13619.686000000002,null,7250.527,null,217.87800000000001,null,null,3510.7460000000001]
["Slovakia",5023.277,2330.6440000000002,1641.6960000000001,34200.640999999996,33161.901999999995,745.29200000000003,null,38430.822999999997,null,564.61800000000005,null,null,31620.028000000002]
["Spain",203073.31799999974,430839.42499999999,87806.331000000006,389771.79200000002,393617.18100000033,61920.206000000013,6473.3459999999995,70890.722999999998,6889.9029999999993,97.048000000000002,153.92400000000001,1612.1130000000001,51330.294000000009]
["Sweden",259614.26400000034,183204.97399999993,59861.981000000007,202755.90700000006,38936.199000000001,29736.539999999997,1150.941,6797.9999999999991,232.07400000000001,5482.6959999999999,50.581000000000003,3624.0360000000001,2846.9250000000002]
["Switzerland",227373.95400000009,182519.06500000009,47723.264000000025,8563.5120000000006,269913.74600000039,31788.931,1221.675,20239.085999999999,530.80500000000006,3510.2290000000007,341.71899999999999,null,22042.812999999998]
["Turkey",65643.203999999998,24123.762999999995,5540.6880000000001,11761.275999999998,10235.167000000001,22113.044999999998,null,12034.393999999998,null,null,null,null,2734.9500000000003]
["Rest of Europe",106030.802,103185.45599999999,22683.843999999997,95133.251000000004,62747.142999999989,17091.052999999996,1644.954,62045.338000000011,null,1862.1320000000001,null,909.274,8742.3719999999994]
["Europe",3760892.4390000016,2845609.3620000002,1071988.2770000014,3318175.1720000026,4083511.6540000029,1133994.0299999991,55894.91,2891906.6390000065,322594.09700000013,418090.1810000008,2569.8910000000001,620538.2770000007,3568830.407000015]
["Egypt",40358.927999999971,1203.6760000000002,913.96199999999999,null,4207.3470000000007,null,null,null,null,975.97200000000009]
["Morocco",11617.665999999999,10436.221,null,3070.395,null,null,null,null,null,null,null,null,1237.2350000000001]
["Tunisia",6549.2479999999996,1948.0420000000001]
["Other North Africa",14250.338000000002,5598.0650000000005,5792.3300000000008,null,1792.3389999999999,null,null,null,null,null,null,null,1237.2350000000001]
["South Africa",165677.56799999977,19942.891000000007,5254.8789999999999,591.02700000000004,12881.368000000004,4048.317,null,5494.0420000000004,null,1159.7450000000001,172.61,3082.6869999999999,7860.4840000000004]
["Nigeria",135742.06900000008,4149.7640000000001,2388.018,null,6392.920000000001,2156.5080000000003,null,1056.0350000000001,null,null,null,null,2260.3150000000005]
["Other Africa",98049.705000000031,13850.408000000001,6054.2610000000004,2175.5170000000003,7592.0090000000018,1528.5729999999999,null,null,null,null,null,3620.3850000000002,12335.228999999999]
["Israel",83627.97000000003,8582.4110000000001,9884.6960000000036,4969.0170000000007,41064.375999999997,3912.1550000000002,null,null,null,null,359.62,null,5833.9510000000009]
["United Arab Emirates",168101.2030000003,20974.526000000005,30853.840000000007,909.0680000000001,22331.20099999999,14348.010999999999,868.65800000000002,null,null,1072.0590000000002,null,null,2854.009]
["Other Middle East",301913.13299999986,6888.3630000000003,23634.653999999999,1932.2080000000001,21993.478000000003,10539.158000000001,676.90300000000002,2112.0709999999999,null,2870.0330000000004,152.4,null,5827.4290000000001]
["Hong Kong (China)",112589.99799999999,10650.997000000001,9199.2259999999987,null,11677.03,7709.1840000000002,881.23599999999999,1119.731,520.69000000000005,null,null,null,8966.369999999999]
["Other China",130962.01299999999,5780.6260000000002,24288.106999999996,2830.8610000000003,26172.872999999996,12394.73,null,1097.961,null,null,179.81,3191.2139999999999,25773.155999999992]
["India",232816.72700000019,8526.9230000000007,17673.642000000003,null,32081.808000000001,14792.954,null,13196.15,null,25114.105,null,994.84900000000005,30052.743000000002]
["Japan",139255.19900000008,6048.5050000000001,7870.7889999999998,3404.3210000000004,9268.0450000000001,4735.4320000000016,730.93100000000004,1435.614,2790.1559999999999,null,null,null,45166.520999999993]
["Pakistan",41674.827999999994,973.05400000000009,13493.678000000005,null,2624.0720000000001,1237.4680000000001,null,1182.577,null,null,null,null,1781.962]
["Sri Lanka",18439.918000000001,2805.6120000000001,1811.6370000000002,null,1085.9230000000002,285.18299999999999]
["Thailand",55327.777999999998,null,7088.3129999999992,null,6901.0910000000003,285.18299999999999,null,null,null,null,null,null,4949.3819999999996]
["Other Asia",366104.91099999973,36684.036000000007,33003.157999999996,8012.6190000000006,35054.002,23676.517,2759.2280000000001,9526.7379999999994,null,2363.3160000000007,null,3154.2380000000003,116523.36699999994]
["Australia",545129.23699999892,102061.21400000002,58308.947999999968,21931.800000000003,75348.38,40326.938000000038,3194.6220000000003,77620.064000000013,4780.1190000000006,4773.5059999999994,332.21,25030.839,111124.31399999995]
["New Zealand",87944.99500000001,17943.156000000003,10810.097,5579.482,14046.261999999997,2561.0250000000005,2351.0120000000002,7639.5789999999997,null,96.087000000000003,539.42999999999995,1685.1380000000001,14860.212000000003]
["Barbados",271.78200000000004,9860.4580000000005]
["Jamaica",null,9799.0380000000005]
["Other Caribbean",22662.634999999998,37280.532999999996,1220.701,866.221,5732.567,250.72900000000004,null,1076.9740000000002]
["Brazil",131899.23500000007,21363.945,6705.5610000000015,5325.3590000000004,11978.64,null,null,6837.3539999999994,null,null,null,842.56900000000007,72234.585999999996]
["Mexico",55678.079999999973,4604.875,1364.9630000000002,5803.9480000000012,5964.4750000000004,null,null,3524.9819999999995,510.57399999999996,null,null,null,30734.472999999991]
["Other Central & Sth. America",79408.85000000002,46586.858,3373.9080000000004,4559.1980000000003,17103.751,2815.4670000000001,null,25967.288,6247.201,2015.2570000000001,null,1935.2469999999998,65949.107999999978]
["Rest of the World",2961.5470000000005,null,1531.2,null,1698.3790000000001,5169.5759999999991]

{"sheet":"Transport","index":8,"n_rows":62,"n_cols":8,"rows_kept":62,"cut":false,"hidden":true,"merged":[[1,0,1,7],[2,1,2,2],[2,0,3,0],[2,3,2,7]]}
[]
["2013: Visits to the UK; by nation of residence and type of vehicle used"]
["Nationality","Air",null,"Sea and Channel Tunnel"]
[null,"All travellers","Foot","Private vehicle","Coach","Goods vehicle","Vehicle type unknown","Total sea and Channel Tunnel"]
["Canada",647061.6399999999,74254.666999999958,5226.4319999999998,17314.905999999999,null,null,96796.004999999917]
["USA",2447216.3499999917,285951.48300000018,15656.129000000001,41531.670999999995,148.667,null,343287.94999999995]
["Austria",261124.99800000046,2618.3220000000001,7871.670000000001,2170.4750000000004,1343.7630000000001,null,14004.230000000001]
["Belgium",184351.606,453451.38899999979,326188.71999999974,155412.58499999996,66950.16,1967.54,1003970.394000003]
["Bulgaria",70836.552000000025,null,10233.963,1398.1290000000001,43994.777000000009,null,55626.868999999999]
["Czech Republic",202150.38100000005,201.38,17339.96,69550.844000000026,69237.730999999985,null,156329.91499999998]
["Cyprus",119133.66100000001,1622.83,1401.1630000000002,1119.731,null,null,4143.7240000000011]
["Denmark",630952.0190000002,22528.953000000001,23483.885000000002,24001.521999999997,1772.0030000000002,null,71786.363000000012]
["Finland",209214.55400000015,3695.8090000000007,2239.462,null,null,null,5935.2710000000006]
["France",1425416.6859999977,1336551.7730000045,587215.99300000083,504333.87100000016,75779.653999999995,1097.961,2504979.2520000115]
["Germany",2187566.0899999966,83129.385000000009,497070.40300000145,336451.64400000055,57762.632999999994,null,974414.06499999901]
["Greece",168661.13999999998,1393.8630000000001,533.42100000000005,3476.7290000000003,3673.0029999999997,null,9077.0159999999996]
["Hungary",130432.84000000011,3171.5920000000001,12124.221,16430.932000000001,118395.27900000002,null,150122.02399999995]
["Irish Republic",1765350.8179999997,95542.588000000047,276825.9340000003,36161.858999999997,29213.11,191419,629162.49100000074]
["Italy",1588070.421000001,12239.963000000002,33567.219000000012,9396.3289999999997,22533.870000000003,null,77737.381000000008]
["Lithuania",118171.89800000006,{"$error":"#VALUE!"},22194.507999999998,8665.6229999999996,55913.667000000001,null,86773.798000000053]
["Luxembourg",61952.211999999992,6223.7810000000009,20857.249999999996,2787.069,null,null,29868.099999999995]
["Malta",83034.063999999969,155.44800000000001,1250.9570000000001,null,null,null,1406.4050000000002]
["Netherlands",1067143.1450000021,147232.10700000002,444082.97899999976,154521.60799999995,108576.84599999995,384.86500000000001,854798.40499999793]
["Norway",840620.41000000038,3790.5740000000005,5803.6929999999993,null,null,null,9594.266999999998]
["Poland",785617.625,7829.1140000000005,66083.656999999992,65256.872000000018,432221.10700000002,null,571390.7499999993]
["Portugal",250263.26199999999,1622.83,5716.4979999999996,5087.4160000000002,22982.558000000005,null,35409.301999999996]
["Romania",174297.00799999991,null,18039.856,16020.579000000002,177342.98599999989,null,211403.42099999983]
["Russia",202800.80400000027,3003.1330000000003,1291.5160000000001,4136.2780000000002,2548.2240000000002,null,10979.150999999998]
["Slovakia",77103.452000000048,244.41200000000001,1387.5440000000001,23166.816000000003,45816.696999999993,null,70615.469000000026]
["Spain",1573501.5990000018,6200.3909999999996,29421.673000000003,11913.991000000002,83437.949999999983,null,130974.00499999998]
["Sweden",775260.80599999893,7930.1539999999995,7516.9709999999995,3587.1869999999999,null,null,19034.311999999998]
["Switzerland",769104.14700000093,15189.919999999996,30398.23,1076.5020000000002,null,null,46664.651999999987]
["Turkey",139417.14299999992,2734.9500000000003,null,null,12034.393999999998,null,14769.343999999999]
["Rest of Europe",408516.5029999995,5074.121000000001,8447.3319999999985,5258.9500000000007,54778.713000000003,null,73559.116000000024]
["Europe",16270065.843999954,2223378.7820000052,2458588.6780000008,1461383.5409999986,1486309.1249999988,194869.36600000001,7824529.4919999568]
["Egypt",46683.91299999995,null,975.97200000000009,null,null,null,975.97200000000009]
["Morocco",25124.281999999999,1237.2350000000001,null,null,null,null,1237.2350000000001]
["Tunisia",8497.2900000000009]
["Other North Africa",27433.072000000007,1237.2350000000001,null,null,null,null,1237.2350000000001]
["South Africa",208396.04999999987,7040.0830000000005,2511.1579999999999,8218.327000000003,null,null,17769.568000000003]
["Nigeria",150829.27900000016,1444.6080000000002,1056.0350000000001,815.70699999999999,null,null,3316.35]
["Other Africa",129250.473,5640.3779999999997,8147.2980000000007,2167.9380000000001,null,null,15955.614000000001]
["Israel",152040.62500000012,5133.5770000000011,1059.9940000000001,null,null,null,6193.5710000000008]
["United Arab Emirates",258386.5070000001,3014.2740000000003,96.087000000000003,815.70699999999999,null,null,3926.0679999999998]
["Other Middle East",367577.89699999936,6990.9550000000008,3970.9779999999996,null,null,null,10961.933000000001]
["Hong Kong (China)",152707.67099999994,8504.08,2102.7110000000002,null,null,null,10606.790999999999]
["Other China",202429.20999999988,27050.926999999996,null,3191.2139999999999,null,null,30242.140999999996]
["India",305892.05400000024,16792.599000000002,1753.1610000000003,50812.087,null,null,69357.847000000023]
["Japan",171313.22199999995,46152.493000000002,3239.7979999999998,null,null,null,49392.291000000005]
["Pakistan",60003.100000000006,1781.962,1182.577,null,null,null,2964.5390000000002]
["Sri Lanka",24428.273000000008]
["Thailand",69602.365000000034,4949.3819999999996,null,null,null,null,4949.3819999999996]
["Other Asia",505294.47099999996,117813.37999999993,1782.3500000000001,10483.610999999999,1488.318,null,131567.65899999993]
["Australia",846301.13899999904,135757.95399999994,26671.71,60342.993999999999,null,888.39400000000001,223661.05199999991]
["New Zealand",141236.02900000001,16661.866000000002,5962.6580000000013,2195.922,null,null,24820.445999999996]
["Barbados",10132.240000000002]
["Jamaica",9799.0380000000005]
["Other Caribbean",68013.386000000013,null,1076.9740000000002,null,null,null,1076.9740000000002]
["Brazil",177272.74000000014,50461.938999999977,4234.018,25218.552,null,null,79914.508999999991]
["Mexico",73416.341,14340.078000000001,null,20429.950999999997,null,null,34770.028999999995]
["Other Central & Sth. America",153848.03200000015,39321.47399999998,5696.9580000000005,57095.669000000024,null,null,102114.101]
["Rest of the World",11360.701999999997]

{"sheet":"Gender","index":9,"n_rows":62,"n_cols":19,"rows_kept":62,"cut":false,"hidden":false,"merged":[[1,0,1,8],[2,0,4,0],[2,1,2,4],[2,5,2,8],[3,1,3,2],[3,3,3,4],[3,5,3,6],[3,7,3,8],[3,10,3,11],[3,12,3,13],[2,10,2,13],[2,15,2,18],[3,15,3,16],[3,17,3,18]]}
[]
["2013: Visits to and spending in UK; by nation of residence, gender and purpose of visit"]
["Nationality","Male",null,null,null,"Female",null,null,null,null,"Visits Percentage Split",null,null,null,null,"Spending Percentage Split"]
[null,"Leisure",null,"Business",null,"Leisure",null,"Business",null,null,"Male",null,"Female",null,null,"Male",null,"Female"]
[null,"Visits","Spending","Visits","Spending","Visits","Spending","Visits","Spending",null,"Leisure","Business","Leisure","Business",null,"Leisure","Business","Leisure","Business"]
["Canada",306051.9910000001,202344799.36300004,68208.399000000019,83982865.960999981,344279.81899999996,216534507.08300009,25317.436000000002,27782613.147,null,{"$f":"IFERROR(B6/(B6+D6),\"n/a\")","v":0.81775148847571066},{"$f":"IFERROR(D6/(B6+D6),\"n/a\")","v":0.18224851152428928},{"$f":"IFERROR(F6/(F6+H6),\"n/a\")","v":0.93149993497651928},{"$f":"IFERROR(H6/(F6+H6),\"n/a\")","v":6.8500065023480772E-2},null,{"$f":"IFERROR(C6/(C6+E6),\"n/a\")","v":0.70668965618125856},{"$f":"IFERROR(E6/(C6+E6),\"n/a\")","v":0.29331034381874149},{"$f":"IFERROR(G6/(G6+I6),\"n/a\")","v":0.88628462417678533},{"$f":"IFERROR(I6/(G6+I6),\"n/a\")","v":0.11371537582321474}]
["USA",1003913.0420000001,766133628.64799964,533572.35900000029,698468035.68300033,1065963.101999999,870072657.91900027,185561.84500000003,206650414.86599997,null,{"$f":"IFERROR(B7/(B7+D7),\"n/a\")","v":0.65295777205236682},{"$f":"IFERROR(D7/(B7+D7),\"n/a\")","v":0.34704222794763312},{"$f":"IFERROR(F7/(F7+H7),\"n/a\")","v":0.85173140539882497},{"$f":"IFERROR(H7/(F7+H7),\"n/a\")","v":0.14826859460117511},null,{"$f":"IFERROR(C7/(C7+E7),\"n/a\")","v":0.52310034004908346},{"$f":"IFERROR(E7/(C7+E7),\"n/a\")","v":0.4768996599509166},{"$f":"IFERROR(G7/(G7+I7),\"n/a\")","v":0.80807468504274915},{"$f":"IFERROR(I7/(G7+I7),\"n/a\")","v":0.19192531495725071}]
["Austria",108609.379,60902278.190000005,50805.957000000002,25680964.880000006,99085.236999999994,49204146.699999996,16628.655000000002,5725255.7999999989,null,0.6812981845109306,0.3187018154890694,0.85629508512253649,0.14370491487746348,null,0.70339566907608553,0.29660433092391447,0.89577065215664786,0.10422934784335219]
["Belgium",458975.40900000028,178211963.24700001,255438.12500000006,56120722.767999992,405807.34200000047,130004161.78400007,68101.124000000011,21405755.868000001,null,0.64245060760565054,0.35754939239434946,0.85629899255692987,0.14370100744307013,null,0.76050834511235188,0.23949165488764815,0.85862381936433718,0.14137618063566287]
["Bulgaria",33401.331000000006,16044455.586000001,49326.306000000011,11674635.540000001,36212.523000000001,19128665.374000002,7523.2609999999995,3450609.2059999998,null,0.40375057491367727,0.59624942508632273,0.82798385413646636,0.17201614586353361,null,0.5788232923319262,0.4211767076680738,0.84717803073016174,0.15282196926983824]
["Czech Republic",112118.776,44421747.350000001,114080.917,29775746.131000001,118260.325,44526400.223000005,14020.278,3515474.9540000004,null,0.49566281241593019,0.50433718758406976,0.89401108188174794,0.10598891811825201,null,0.59869606459651126,0.40130393540348869,0.92682477648826178,7.3175223511738149E-2]
["Cyprus",52495.880999999994,53983505.772000007,6897.8600000000015,9705808.8779999986,63076.902999999998,58067500.067000009,806.74099999999999,923885.41500000004,null,0.88386217328859618,0.11613782671140385,0.98737171285971093,1.2628287140288991E-2,null,0.84760695053263546,0.15239304946736459,0.98433863847320724,1.566136152679283E-2]
["Finland",76053.781999999977,38968824.093999997,31261.456000000002,21770677.594999999,94250.285999999993,50766508.062999994,13584.300999999999,7918113.6960000023,null,0.7086950876444964,0.2913049123555036,0.87402649393000409,0.12597350606999588,null,0.64157299632666076,0.3584270036733393,0.86507344754615101,0.13492655245384902]
["France",1387441.0870000001,484614309.46500015,606887.13899999985,182474903.61900008,1742207.4450000015,615387886.09700012,193860.26699999996,65765321.747000001,null,0.69569345151513706,0.30430654848486305,0.89986906666619737,0.10013093333380264,null,0.72646101894616799,0.27353898105383206,0.90345003005247282,9.6549969947527264E-2]
["Germany",1156270.9800000004,524504980.78600001,674024.65199999989,258964858.39400002,1155217.6110000003,523424826.25199997,168761.55599999998,99231656.358999968,null,0.63174000952869036,0.36825999047130969,0.87253458346901613,0.12746541653098378,null,0.66946416384702256,0.33053583615297738,0.84063177830753555,0.15936822169246445]
["Greece",54890.899999999987,48374805.279999986,31286.108000000004,27594581.077999987,83964.260000000024,63423385.541000009,7596.887999999999,7063657.8600000013,null,0.63695527698060717,0.36304472301939295,0.91702934961016447,8.2970650389835629E-2,null,0.63676709262909381,0.36323290737090613,0.8997878543462956,0.10021214565370447]
["Hungary",56975.653000000006,25000170.23,139416.94900000005,13476812.674000001,71479.671999999991,26332039.301999997,12682.590000000002,10657390.878999999,null,0.29011099409946201,0.70988900590053794,0.84930787625456172,0.15069212374543836,null,0.64974351789420126,0.35025648210579874,0.71188010123837275,0.2881198987616273]
["Irish Republic",940102.11527195235,301043467.36956406,404480.5283682007,159503890.25954351,925558.94372804754,276831760.19843608,124371.72163179921,46981926.297456458,null,0.69917763680694156,0.30082236319305838,0.88154291922774464,0.11845708077225539,null,0.65366451979951057,0.34633548020048943,0.85491062219801384,0.14508937780198616]
["Italy",645282.59100000025,317531566.59099996,221450.83600000007,128023415.27299999,730571.70199999982,354264377.19099998,68502.672999999995,30247224.910999998,null,0.74449948611477745,0.25550051388522249,0.91427246931801565,8.572753068198441E-2,null,0.71266528153852504,0.2873347184614749,0.92133598896457669,7.866401103542324E-2]
["Lithuania",59006.624000000003,22832667.325000003,66645.380999999994,5445925.0229999991,75883.251999999993,36528537.781999998,3410.4390000000003,1133156.4620000001,null,0.46960352124902427,0.53039647875097573,0.95698978119204969,4.3010218807950314E-2,null,0.80741880798090149,0.19258119201909854,0.96991222820039424,3.0087771799605825E-2]
["Luxembourg",33692.962,20556105.288999997,23906.336000000003,9161590.0449999999,29816.678,13134012.013,4404.3360000000002,1072558.5450000002,null,0.58495438607602468,0.41504561392397527,0.87129732625690159,0.12870267374309832,null,0.69171263309512998,0.30828736690486996,0.92450264188523523,7.5497358114764809E-2]
["Malta",44979.102000000006,22066789.858999997,10693.934000000001,7575485.415000001,26029.433000000001,18446985.082000006,2738.0000000000005,4618447.4450000003,null,0.80791537935886948,0.19208462064113047,0.90482292945637521,9.5177070543624814E-2,null,0.74443643934294568,0.25556356065705438,0.79976757688832745,0.20023242311167258]
["Netherlands",643443.64999999979,256427957.06800002,526268.64399999997,191021187.24899998,643349.70400000003,231090236.42500001,108879.55200000003,41392153.412999988,null,0.55008710543654415,0.44991289456345585,0.85525748815066027,0.14474251184933973,null,0.57308849580977395,0.42691150419022594,0.84809237236355339,0.15190762763644661]
["Norway",327953.65499999997,180520492.73100004,144398.45000000001,117376719.61099997,335078.68599999987,208160161.87099996,41012.182999999997,28578460.144000001,null,0.69429912882467193,0.30570087117532802,0.89095139930132139,0.10904860069867851,null,0.60598248406485267,0.39401751593514739,0.8792826455575582,0.12071735444244179]
["Poland",318937.45000000007,139437499.62899998,532378.64900000009,102936464.11100002,463871.84400000004,173140642.22600004,41820.432000000001,33513046.109000001,null,0.37464045420336872,0.62535954579663133,0.91730063126374506,8.2699368736254927E-2,null,0.57529900273685219,0.42470099726314775,0.83782991545414365,0.16217008454585632]
["Portugal",95284.719000000012,46532701.529000007,63214.689000000006,29369013.828000002,118158.37300000001,33895902.924000002,9014.7829999999994,4873026.142,null,0.60116766492907026,0.39883233507092969,0.92911410486659629,7.0885895133403778E-2,null,0.61306521611712883,0.38693478388287117,0.87430588722984359,0.12569411277015644]
["Romania",80807.359999999986,57928944.203000002,197272.72899999999,37608132.897999994,92275.036999999997,52751277.249999993,15345.303,10014133.139,null,0.29059024071299111,0.70940975928700889,0.85741261363790522,0.14258738636209475,null,0.60635039254716383,0.39364960745283617,0.8404514034571654,0.15954859654283463]
["Russia",64633.314999999981,104140851.21800002,30859.442000000006,27049366.951000005,98770.235000000015,108346661.27200001,19516.963000000003,17721456.121999998,null,0.6768399722714048,0.32316002772859531,0.83500359016028092,0.16499640983971908,null,0.79381567217035309,0.20618432782964694,0.85942951724570282,0.14057048275429723]
["Slovakia",45271.695000000007,15226346.617000001,49778.046999999991,4506990.5410000011,41104.201000000001,12827691.975000001,11564.977999999999,2928840.0150000006,null,0.47629476995318942,0.52370523004681058,0.78042228453950269,0.21957771546049729,null,0.77160525333786023,0.22839474666213988,0.81411899415056499,0.18588100584943504]
["Spain",664089.99499999965,309313866.95599991,276510.16300000012,177127543.17099997,693018.45999999985,370337066.68399996,69155.421000000002,47221107.980000004,null,0.70602794327831675,0.29397205672168319,0.90926555904898554,9.0734440951014461E-2,null,0.63587075548367566,0.36412924451632439,0.88691130758487047,0.11308869241512948]
["Sweden",303582.12000000005,166470043.28599998,123709.85500000001,80388628.011000007,313001.54699999996,163277754.23199996,53585.566000000006,36094735.156000003,null,0.71047933909828287,0.28952066090171713,0.85382583266095335,0.14617416733904667,null,0.67435363891154121,0.32564636108845874,0.8189582962684695,0.18104170373153053]
["Switzerland",253790.70500000002,179533255.26100001,181278.94499999998,117499798.67900001,327752.679,183051695.27499995,52946.470000000016,23181729.355999999,null,0.58333350763492697,0.41666649236507297,0.86092306710147115,0.13907693289852879,null,0.60442180720151539,0.39557819279848466,0.88759470295623721,0.11240529704376272]
["Turkey",53821.934000000008,51606503.011000007,37373.563999999998,23256642.978999998,49350.010999999999,49765338.204000004,13361.639000000001,16090226.457,null,0.59018191884866955,0.40981808115133045,0.7869352983058171,0.21306470169418282,null,0.68934456772486485,0.31065543227513509,0.75567400355874992,0.24432599644125005]
["Rest of Europe",157432.73299999998,119329069.51100001,111596.00899999999,56059260.698000006,182782.01599999997,150063966.933,29952.659,27572890.982000001,null,0.58518926947961569,0.41481073052038436,0.85920180149286896,0.14079819850713102,null,0.68037063451600532,0.31962936548399462,0.84477944889571432,0.15522055110428573]
["Europe",8475353.2682719547,4008446692.984478,5098913.6313682003,1986386417.8235433,9291575.2167280521,4236464646.7225194,1216567.0246317992,625218676.87945592,null,0.62436913396012805,0.37563086603987206,0.8842262507788089,0.11577374922119098,null,0.66865025579405901,0.33134974420594099,0.87139872442036448,0.12860127557963552]
["Egypt",17853.026999999998,28123898.872000005,7842.3100000000013,14199631.074000001,18042.351999999995,28066890.577000011,3922.1959999999999,9014576.4900000021,null,0.6947963749220335,0.30520362507796656,0.82143060717661931,0.17856939282338069,null,0.66449794967203557,0.33550205032796432,0.75689806248193547,0.24310193751806444]
["Morocco",9686.4650000000001,15720037.130999999,2113.86,2649692.4230000004,11696.430000000002,12964455.336000001,2864.7619999999997,12309658.016000001,null,0.82086425585735978,0.17913574414264014,0.80326047482925844,0.19673952517074145,null,0.85575767921836232,0.14424232078163782,0.51295391278183422,0.48704608721816578]
["Tunisia",4745.4920000000002,7394274.8689999981,446.00900000000001,897370.10800000001,2895.9960000000001,3804524.0619999999,409.79300000000001,424545.54800000001,null,0.91408862292427562,8.5911377075724341E-2,0.87603776284572299,0.12396223715427693,null,0.89177417623533162,0.10822582376466842,0.899612541965229,0.10038745803477091]
["Other North Africa",11632.466,14790347.226999998,9796.0840000000007,15045806.328000002,6795.7480000000014,5051357.7240000004,446.00900000000001,363497.33500000002,null,0.54284895618228945,0.45715104381771043,0.93841149323292672,6.1588506767073233E-2,null,0.49571896725009995,0.50428103274989999,0.93287034813686598,6.7129651863134021E-2]
["South Africa",88141.478000000017,81131046.572000012,38424.578000000009,52126524.342,84722.794999999969,66292166.250999995,14402.127000000002,19583304.835000005,null,0.69640692604026466,0.30359307395973528,0.85470730559566033,0.14529269440433967,null,0.60882879685957425,0.39117120314042586,0.77195694431314033,0.22804305568685967]
["Nigeria",66432.698999999964,103597014.132,20694.331999999999,59551371.983999997,60594.981999999982,89409097.884999961,6423.6160000000009,18248899.063999999,null,0.76248092282634994,0.23751907717365014,0.90415174008862431,9.5848259911375688E-2,null,0.6349864476032363,0.3650135523967637,0.83049193203320593,0.16950806796679413]
["Other Africa",61485.15800000001,63116212.635999963,19588.762000000002,34650091.564000003,57431.01200000001,55137641.613999993,6701.1549999999988,10490336.695,null,0.75838392913528785,0.2416160708647121,0.89551023591640067,0.10448976408359939,null,0.6455824749893736,0.35441752501062651,0.84015450475088926,0.15984549524911074]
["Israel",55015.774000000005,31177937.247000005,34483.276000000005,24061761.710999999,61823.94400000001,34272321.143999994,6911.2020000000002,4628849.5949999997,null,0.61470791030742777,0.38529208969257212,0.89945170117191575,0.10054829882808425,null,0.56441178781052548,0.43558821218947452,0.88101001828309011,0.1189899817169099]
["United Arab Emirates",121986.307,240420970.06200007,35276.720999999998,89261955.868000016,100184.50399999997,189162005.44699997,4865.0429999999997,7563941.9800000004,null,0.77568331572504123,0.22431668427495877,0.95368811062079106,4.6311889379208847E-2,null,0.72924907889542168,0.27075092110457843,0.96155086769727327,3.8449132302726813E-2]
["Other Middle East",215061.42300000021,662507914.49000013,39226.56500000001,150864713.92499998,119505.10600000013,303574212.22900003,4746.7360000000008,10669355.675000003,null,0.84573960685866145,0.15426039314133855,0.96179745971089914,3.8202540289100868E-2,null,0.81451955886567462,0.18548044113432544,0.9660474970222479,3.395250297775209E-2]
["Hong Kong (China)",73776.635000000009,110914552.52200003,20839.721999999991,40101971.214000002,59400.412999999993,82694948.117999986,8964.7919999999995,14157840.816000002,null,0.77974503922191807,0.22025496077808185,0.86886908332974355,0.13113091667025648,null,0.73445309015254268,0.26554690984745732,0.85382103115638919,0.14617896884361084]
["Other China",87184.64800000003,200941522.46499997,42706.676999999996,65285531.567999996,89414.534000000014,234035768.08700004,12269.915000000001,32918711.855000004,null,0.67121224608340868,0.32878775391659132,0.87933341704983814,0.1206665829501618,null,0.75477499157577133,0.24522500842422867,0.87668792124353156,0.12331207875646852]
["India",152828.23200000005,135496587.565,88617.37900000003,163557029.54700005,116973.12500000001,96379145.562999994,16831.165000000001,45070381.189000018,null,0.6329716716200734,0.36702832837992649,0.8742105727701257,0.12578942722987432,null,0.45308459691445396,0.54691540308554598,0.68136774845474879,0.31863225154525132]
["Japan",73609.084000000017,60962344.41300001,52398.41599999999,51528689.629999995,84874.248999999996,81906601.037999958,8891.39,12789295.437999999,null,0.58416430768009853,0.41583569231990153,0.90517432510644968,9.4825674893550288E-2,null,0.54193069635840474,0.4580693036415952,0.86494350955068733,0.13505649044931278]
["Pakistan",35763.561000000002,70893011.01699999,7946.982,11070530.935000001,18212.523000000001,28581332.914000005,1044.5729999999999,4513013.5200000005,null,0.81819072803556792,0.181809271964432,0.94575646296824811,5.4243537031751818E-2,null,0.8649334732083297,0.1350665267916703,0.86363188863692186,0.13636811136307814]
["Sri Lanka",9360.7440000000024,7001470.8990000011,4071.5729999999999,3099117.6949999998,9966.3560000000016,5995910.7020000005,1029.5999999999999,1564728.88,null,0.69688230258413353,0.30311769741586647,0.90636557658106309,9.3634423418936907E-2,null,0.69317454461604822,0.30682545538395184,0.79304278916756865,0.20695721083243138]
["Thailand",38939.86,74560387.584000006,3774.2580000000003,6928939.1900000004,28051.496999999999,30346047.651000001,3318.4690000000001,4002301.6710000006,null,0.91163909787391606,8.836090212608394E-2,0.89421509095674501,0.10578490904325494,null,0.91497120587072089,8.5028794129279134E-2,0.8834790681356981,0.11652093186430183]
["Other Asia",254161.72000000006,357303777.52900004,99680.868000000031,137058193.12300003,259488.80800000002,292911176.13000011,23216.534000000003,27736771.505000003,null,0.71829036023216064,0.28170963976783936,0.91787727166471444,8.2122728335285583E-2,null,0.72275741003654093,0.27724258996345902,0.91349774196411415,8.6502258035885876E-2]
["Australia",487673.69099999988,555158558.18199992,46235.651999999995,74582609.742999986,509170.46399999992,521831743.55400002,26882.383999999995,38814733.363000005,null,0.91340168025491919,8.6598319745080782E-2,0.94985124302520263,5.0148756974797384E-2,null,0.88156624730641309,0.11843375269358684,0.9307678992714935,6.923210072850644E-2]
["New Zealand",76088.020999999993,63648011.425999999,10988.971000000001,11743868.054999998,76095.88900000001,54616284.651000001,2883.5940000000005,6000625.9100000001,null,0.87380166967641693,0.12619833032358307,0.96348932798154685,3.6510672018453198E-2,null,0.84422900535382406,0.15577099464617603,0.90100739456258738,9.8992605437412562E-2]
["Barbados",1463.4939999999999,283206.63,"n/a","n/a",8668.746000000001,6595524.245000001,"n/a","n/a",null,"n/a","n/a","n/a","n/a",null,"n/a","n/a","n/a","n/a"]
["Jamaica",763.90100000000007,775359.51500000001,1138.8110000000001,1135394.567,7896.326,3379928.44,"n/a","n/a",null,0.40148009788133987,0.59851990211866013,"n/a","n/a",null,0.40578718229842831,0.59421281770157175,"n/a","n/a"]
["Other Caribbean",24284.303000000004,22774715.208000004,7352.741,12820509.635000002,34438.074000000001,26659871.096999999,3015.2420000000002,3496025.6580000008,null,0.76759077112261187,0.23240922887738816,0.91949332336821665,8.050667663178343E-2,null,0.63982501328345376,0.36017498671654613,0.88406825748200168,0.11593174251799832]
["Brazil",126021.75499999999,128147554.32299992,21058.908000000003,31510324.983000003,102953.92099999997,105848243.977,7152.6650000000009,10926960.740999999,null,0.85682068893039998,0.14317931106959997,0.93503871784745007,6.4961282152549912E-2,null,0.80263845968661907,0.19736154031338088,0.90642738955253832,9.3572610447461638E-2]
["Mexico",48827.686000000016,28014934.168000001,3750.2009999999996,4780122.97,50905.507999999994,25670649.852999993,4151.7510000000011,2056745.9650000001,null,0.92867341740074116,7.132658259925885E-2,0.92459212326570772,7.5407876734292223E-2,null,0.85424257838961903,0.14575742161038097,0.92582260597063326,7.4177394029366711E-2]
["Other Central & Sth. America",129253.14700000001,94769730.060000002,21435.829999999998,23658789.503000002,100046.65000000001,69876025.557000011,5226.5060000000003,5937640.8440000005,null,0.85774785636775541,0.14225214363224456,0.95035290858003729,4.9647091419962749E-2,null,0.80022726290676693,0.19977273709323301,0.92168112787747092,7.8318872122529096E-2]
["Rest of the World",8090.0840000000007,6194665.2199999988,314.2,20423,2956.4180000000001,3466757.8540000003,"n/a","n/a",null,0.96261430479979015,3.738569520020979E-2,"n/a","n/a",null,0.9967139645847215,3.2860354152784662E-3,"n/a","n/a"]

{"sheet":"Nationality","index":10,"n_rows":62,"n_cols":13,"rows_kept":62,"cut":false,"hidden":true,"merged":[[2,0,3,0],[1,0,1,12],[2,1,2,3],[2,4,2,6],[2,7,2,9],[2,10,2,12]]}
[]
["Number of visits to UK: by country of residence, purpose of visit and nationality 2013"]
["Nationality","Holiday",null,null,"Business",null,null,"Personal",null,null,"Other"]
[null,"Country of residence","UK","Other","Country of residence","UK","Other","Country of residence","UK","Other","Country of residence","UK","Other"]
["Canada",261835.82799999998,7734.6940000000004,10054.822000000002,87767.215000000026,1490.1360000000002,4268.4840000000004,236087.72500000003,51490.539999999986,14778.027999999998,54450.601999999992,4755.2570000000005,9144.3140000000021]
["USA",1035054.2670000002,32357.669000000002,55737.027000000016,621249.46600000071,39129.606,58755.132000000027,483887.81500000047,148700.39899999992,47858.077000000005,231790.15100000007,10093.415000000001,25891.275999999998]
["Austria",121062.47900000001,689.84399999999994,10913.637000000001,53047.74,3523.0760000000005,10863.796,29412.782999999999,21551.504000000001,9143.3189999999995,14609.173999999997,null,311.87600000000003]
["Belgium",468827.95599999983,12947.177000000001,63216.304000000011,250405.97200000027,13655.036,59478.240999999995,127895.39100000002,56221.851000000017,37350.289000000004,75006.549999999974,13240.171000000002,10077.062000000002]
["Bulgaria",21825.165999999997,null,null,56849.567000000003,null,null,32571.57499999999,4958.1339999999991,1044.9850000000001,9213.9939999999988]
["Czech Republic",107540.89800000003,2601.2649999999999,7263.2539999999999,117132.38600000003,2617.1329999999998,8351.6759999999995,67668.904999999984,11853.220000000001,4878.2010000000009,26798.863000000001,1276.951,497.54400000000004]
["Cyprus",27403.128000000001,5719.5590000000002,5340.3350000000009,4990.6039999999994,1367.9369999999999,1346.06,22317.852000000003,39801.083000000021,2586.8330000000005,6068.3660000000009,5102.1490000000003,1233.479]
["Denmark",322591.57399999944,2068.3150000000001,10766.851000000002,161889.0380000002,3679.2030000000004,15521.965000000006,91855.488000000027,18485.299000000003,7871.4849999999997,62040.676000000007,3445.6220000000003,2522.866]
["Finland",104563.674,366.822,4124.6369999999997,37639.240999999995,1128.3440000000001,6078.1719999999996,37553.942000000003,5804.4929999999995,1585.5520000000001,15831.775,null,473.173]
["France",1610452.2960000068,65594.40300000002,84763.717999999993,687764.26800000097,58107.661999999997,54875.475999999981,714201.86700000067,336167.19300000009,59564.360999999975,206244.56199999986,39519.400999999998,13140.731]
["Germany",1272700.7159999956,49516.404000000002,63838.761000000006,724867.1549999998,29430.295000000006,88488.758000000118,483700.24400000036,178177.70699999991,57789.528999999973,184957.89600000012,12054.327999999998,16458.362000000001]
["Greece",52736.460000000014,1925.7620000000002,1719.1640000000002,33977.53899999999,null,4905.4570000000003,46618.246000000014,21572.753000000001,2860.9629999999997,9280.2620000000006,912.98699999999997,1228.5630000000001]
["Hungary",48396.447999999989,null,2112.4900000000002,150194.52799999999,null,1905.011,59499.625999999975,1268.2370000000001,1594.0280000000002,14864.33,null,720.16600000000005]
["Irish Republic",497903.71200000017,37434.348999999987,57691.999000000003,428666.68299999984,37853.102999999996,62332.464000000007,676061.22899999935,162919.1510000001,124415.8,236153.09300000008,16085.955999999996,56995.770000000011]
["Italy",786885.9580000001,8647.7960000000003,21473.985000000004,260315.87999999995,3534.1910000000003,26103.437999999995,317376.413,62769.822000000015,20183.037,150532.49300000005,2285.7700000000004,5699.0190000000002]
["Lithuania",31845.61399999999,null,720.16600000000005,66989.237000000023,null,3066.5830000000001,91760.343000000052,null,1988.5550000000001,7717.3440000000001,null,857.85400000000004]
["Luxembourg",21080.108,3357.748,14571.889000000001,11096.031000000001,4387.6489999999994,12826.992,2932.5889999999999,13047.919000000004,3897.6489999999999,1641.0320000000002,2382.4470000000001,598.25900000000001]
["Malta",27904.721000000009,959.81099999999992,1798.155,10385.495999999997,2107.6950000000002,938.74299999999994,17620.602000000003,11293.601000000001,null,9982.9889999999996,671.08900000000006,777.56700000000001]
["Netherlands",654747.8139999985,24562.929,25995.203999999994,535615.97700000065,28476.780000000006,71055.439000000013,331868.99300000025,114506.37699999998,22730.373,100683.33199999999,6935.9849999999997,4762.3469999999998]
["Norway",353410.16500000004,5538.3600000000006,15573.176999999998,162613.636,4644.4459999999999,18152.551000000003,103981.36799999996,37366.555,16007.566999999997,128501.71299999996,1730.3189999999997,2694.82]
["Poland",182559.1099999999,null,2827.6760000000004,568602.76199999976,null,5596.3189999999995,526642.25000000012,8245.2840000000015,1675.7280000000003,59828.463999999978,null,1030.7820000000002]
["Portugal",71862.651000000042,1557.0570000000002,5082.8159999999998,66216.268000000011,869.01700000000017,5144.1869999999999,57263.79599999998,44490.322000000007,3170.125,24276.918999999998,4004.319,1735.087]
["Romania",45379.740999999995,1183.5840000000003,1629.3589999999999,211265.36499999985,null,1352.6670000000001,101057.46800000005,1715.7080000000001,1769.0220000000002,18915.490999999995,null,1432.0240000000001]
["Russia",87205.923999999985,660.11900000000003,6638.2830000000004,44804.187999999995,689.59300000000007,4882.6240000000007,26144.252000000004,6497.3790000000008,1367.6959999999999,32943.223999999995,758.25200000000007,1188.421]
["Slovakia",37469.932000000001,null,3728.4690000000005,57443.461000000003,null,3899.5640000000003,35713.914000000004,1892.5090000000002,342.45300000000003,7228.6189999999997]
["Spain",561723.8879999998,25005.319000000003,39782.716999999997,263721.86299999978,29710.486999999997,52233.234000000019,277104.79799999995,295716.95200000022,25421.273000000005,90662.52900000001,31603.197999999989,11789.346]
["Sweden",366034.1750000008,5850.1370000000006,14524.253000000001,153664.29600000003,9887.6570000000011,14159.497999999998,114878.67699999991,20372.730000000007,8449.4000000000015,83844.247999999934,1070.5360000000001,1559.5110000000002]
["Switzerland",221868.07400000011,16676.144,45329.177000000011,127176.89300000003,27120.195000000007,79928.326999999932,97469.884000000064,78862.247000000018,49015.352999999988,47663.105999999985,6159.7890000000007,18499.610000000008]
["Turkey",40693.914999999986,1474.9680000000003,2928.0520000000001,46924.480000000018,{"$error":"#VALUE!"},3810.723,18906.751000000004,19613.020999999997,3340.1570000000006,13619.880999999999,1656.384,1218.155]
["Rest of Europe",128931.23300000005,6636.2079999999996,7794.88,126708.982,4605.4590000000007,10234.227000000001,103183.974,20720.837,10904.359,55313.275999999983,3914.7359999999999,3127.4480000000003]
["Europe",8580282.4229999706,280974.08000000019,217474.51499999993,5872022.2759999996,267394.95799999998,176479.45200000002,4887139.5159999887,1595891.8880000017,207071.79600000009,1791298.7290000007,154810.38899999997,63755.313999999998]
["Egypt",13817.11999999999,1282.2470000000001,1128.414,9430.5810000000019,1253.1300000000001,1080.7949999999998,8806.0480000000007,4609.0670000000009,2398.2260000000001,2659.9609999999998,null,1194.296]
["Morocco",2865.1860000000001,null,2001.4190000000003,4337.4180000000006,null,641.20399999999995,7430.8470000000007,1282.0910000000001,2632.7920000000004,2761.261,1282.0910000000001,1127.2080000000001]
["Tunisia",1011.889,480.827,561.72300000000007,409.79300000000001,null,446.00900000000001,2252.1970000000001,324.44200000000001,989.53,511.69399999999996,550.67399999999998,958.51200000000006]
["Other North Africa",4922.9680000000008,955.60899999999992,null,7915.2119999999995,1776.2070000000001,550.67399999999998,6295.7080000000005,null,1398.3620000000001,4428.0369999999994,427.53000000000003]
["South Africa",48729.249999999985,8469.3109999999997,3487.857,40195.19200000001,10106.075000000001,2525.4380000000001,57831.078999999998,34112.407000000007,8347.3419999999987,9508.0259999999998,1991.1569999999999,862.48400000000004]
["Nigeria",57829.511000000006,931.17600000000004,null,23312.558000000008,289.36599999999999,3516.0239999999999,43384.714999999989,5925.9370000000008,2335.46,15828.893,null,791.98900000000003]
["Other Africa",13082.631000000003,1471.9090000000001,10223.678999999998,17702.439999999995,3601.6950000000002,4985.7819999999992,36131.678999999996,23220.771999999997,14887.284999999996,10445.507,4426.3429999999998,5026.3649999999989]
["Israel",55201.455000000002,2483.0690000000004,1627.2720000000002,38889.122000000018,449.95400000000001,2055.402,31321.849000000006,8865.3330000000024,5384.49,9393.2530000000024,null,2562.9970000000008]
["United Arab Emirates",37640.094000000005,20353.174000000006,28782.356000000003,4310.6379999999999,7317.8220000000019,28513.303999999993,6290.7980000000007,82837.82699999999,24313.104000000007,7997.7210000000014,6321.5250000000015,7634.2120000000014]
["Other Middle East",161901.15200000003,10535.266000000001,14352.655000000002,27138.669000000009,4894.639000000001,11939.992999999999,44387.29099999999,44660.958999999988,11176.641999999998,34573.318999999996,2891.0550000000007,10088.190000000002]
["Hong Kong (China)",36126.332999999999,12425.256000000005,14886.616000000004,9246.3369999999995,7488.4859999999981,13069.690999999999,9158.1570000000011,36997.393000000011,9882.6950000000015,5374.4740000000011,3690.7950000000001,4968.2290000000003]
["Other China",83261.786000000007,1688.5750000000003,2204.9940000000001,45791.328999999998,4138.6679999999997,5046.5950000000003,31498.095999999998,15941.562,5943.3760000000002,31502.683999999997,2811.183,2842.5029999999997]
["India",127044.17900000009,997.45700000000011,2315.0750000000003,101867.42900000008,807.51600000000008,2773.5989999999997,103009.46600000006,4944.5460000000012,2792.2130000000002,26502.094000000005,914.57400000000007,1281.7530000000002]
["Japan",109314.21400000001,791.56200000000001,1372.3100000000002,57234.921000000009,2143.2350000000001,1911.6500000000003,17961.088000000003,5913.2549999999992,2494.5300000000002,21062.938000000002,null,505.81]
["Pakistan",14326.524000000003,787.25300000000004,2515.9580000000001,8668.11,323.44499999999999,null,27015.881999999998,1006.246,1279.8040000000001,6306.4589999999998,314.2,423.75800000000004]
["Sri Lanka",1661.0550000000001,null,null,4377.5929999999998,null,723.58,13534.182000000001,1636.519,null,2063.5169999999998,null,431.827]
["Thailand",28204.552000000003,2055.4250000000002,2572.3609999999999,4385.2840000000006,300.12600000000003,2407.317,11019.224000000002,15775.425999999999,1480.1840000000002,4423.2470000000003,488.65300000000002,1439.9479999999999]
["Other Asia",261099.43400000004,11870.893,15955.674999999997,94822.308000000034,8979.4269999999997,19095.666999999994,99182.901999999987,55599.926000000014,10162.616999999997,47843.975000000013,2543.1540000000005,9706.1520000000019]
["Australia",453128.49899999984,31000.030000000006,24518.857999999993,54272.210999999988,9305.5530000000017,9540.2720000000008,283331.71400000004,115675.43300000006,24080.752000000004,57348.094000000005,4400.7119999999995,3360.0630000000001]
["New Zealand",43198.995999999999,8797.5650000000005,2483.009,8102.7520000000022,3600.8880000000008,2168.9250000000002,55058.826000000015,25964.232,7677.41,7298.8390000000009,520.77800000000002,1184.2550000000001]
["Barbados",1304.1860000000001,null,null,null,null,null,1921.0419999999999,2435.4460000000004,null,3436.9950000000003,1034.5710000000001]
["Jamaica",1034.5710000000001,null,null,null,null,1138.8110000000001,7625.6560000000009]
["Other Caribbean",5624.9350000000004,5125.2849999999999,3251.2440000000001,1138.8110000000001,2825.163,6404.009,13005.106,16448.670000000002,3145.009,4982.0430000000006,3636.1970000000001,3503.8879999999999]
["Brazil",167416.25699999995,710.18799999999999,7443.1420000000007,21946.831999999999,1581.239,4683.5020000000004,26791.849000000013,4305.4220000000005,2328.2930000000006,19492.752000000004,487.77300000000002]
["Mexico",70799.584000000032,462.90800000000002,3546.11,7450.2800000000007,null,451.67200000000003,9706.2010000000009,2949.5980000000004,475.71300000000002,10252.042999999998,1133.4650000000001,958.79599999999994]
["Other Central & Sth. America",150652.17000000004,787.30600000000004,17027.401000000002,24068.471000000001,509.75800000000004,2084.1070000000004,29257.745000000003,6876.8380000000016,4309.54,17042.250000000004,null,3346.547]
["Rest of the World",null,314.51400000000001,6470.3659999999991,null,null,314.2,null,1326.671,1103.221,null,427.97900000000004,1403.7510000000002]

{"sheet":"Purpose","index":11,"n_rows":52,"n_cols":5,"rows_kept":52,"cut":false,"hidden":true,"merged":[[52,0,52,4],[53,0,53,4],[54,0,54,4],[55,0,55,4]]}
["Visits in the top 50 UK towns stayed in: by purpose"]
[null,"Holiday","Business","Visiting","Other"]
["London",8501466.3783140853,3239421.260291216,3773352.8200072413,1269908.2313004709]
["Edinburgh",837572.74872417958,133939.77348966393,274869.35695849109,56526.978926440795]
["Manchester",221708.93002336446,335752.46435876604,248047.939120494,182479.36833073775]
["Birmingham",158053.32830619981,483247.9160604268,242668.94921973679,56769.288946793538]
["Liverpool",194540.51289741663,126042.91520305764,135747.81073529666,105521.125134175]
["Glasgow",261782.1574010319,87979.74481360997,142306.57779220183,22942.532850160162]
["Oxford",168860.45160408033,122846.38706087017,114523.40288217517,49867.695912696836]
["Bristol",142990.30451997768,103581.24804354532,156251.74812277648,25423.943219323817]
["Brighton / Hove",216375.57521160506,45810.588660131856,111473.06860337095,35564.510381091786]
["Cambridge",126274.20484205153,101099.7582187363,135501.49078461141,41140.157571766737]
["Leeds",48044.891199425663,114759.6959252068,107018.97447676353,29627.525994966531]
["Cardiff",128393.7471895479,71446.821409287717,73111.092383878946,24077.692772282015]
["Bath",180023.79109411745,14462.184663139267,74838.99940473579,13274.337937333905]
["York",152160.38058616719,37593.852508234464,70455.416917716037,10750.169519758112]
["Nottingham",49391.261109838219,86922.894089716996,89196.694674416984,21260.07491368398]
["Aberdeen",67981.514625141004,125141.43095069942,42318.646316995837,5216.0136209103566]
["Inverness",193753.4306860897,6557.1860736395756,24665.734208978614,1220.3648470840203]
["Southampton",53977.013292908392,65116.382488320807,78976.142815259343,22912.406696028058]
["Newcastle-upon-Tyne",68833.301352125141,54743.366235484304,68941.864391172479,8464.3860987516036]
["Reading",45390.273949802693,69946.73365832644,67107.071680641326,10470.745439948014]
["Canterbury",102034.70759053766,23193.507814668694,32515.482642949002,19463.269291584063]
["Bournemouth",71463.348676177993,12615.241763816193,67937.673877910493,19129.030034673055]
["Windsor",54847.698074122425,47446.082197272794,50490.645968110548,12908.735401269416]
["Coventry",35982.987104426531,46956.805143167061,52335.693951962501,19454.726135640783]
["Sheffield",20830.215170657058,45273.772056423186,64907.809345713773,20307.321237034197]
["Plymouth",77464.621665599057,21661.774782439577,35654.374215045071,12763.838088101398]
["Leicester",22968.065149036924,47488.848472866361,65093.666483768699,10550.451982874203]
["Luton",15916.736902563176,49301.956060243741,57379.512674333368,19367.21456035307]
["Dover",57577.801047109424,41887.803539978537,23900.303550716053,14089.112442533766]
["Northampton",13164.857672841721,54996.509277703037,53536.516313418928,12854.330833600681]
["Portsmouth / Southsea",48204.0686102236,25424.690318783345,44730.468743995436,15870.11749137307]
["Maidstone",29785.972149941383,37578.599615468862,45150.960987353923,7314.7078369067676]
["Chester",45418.152385890942,21533.675074091861,43318.586183534324,8719.7097279864993]
["Salisbury",82254.700596503826,5410.0950150854405,26305.017941849383,2900.0297936586317]
["Exeter",49881.186145847802,22543.0791261546,27515.764344607436,10126.915614101514]
["Stratford-upon-Avon",56563.0099912437,14692.134324046392,25311.376138681269,8499.1696827631113]
["Fort William",97751.733212550374,null,4902.0728173909729]
["Derby",11927.651070211785,49612.892440764852,35033.518864777187,1266.4355114654215]
["Perth",62089.270443405461,2952.1213164331243,31655.494332308783,151.52600000000064]
["Norwich",23577.833900324753,19245.383807044022,49543.254132193535,3430.996546409398]
["Eastbourne",54171.503732425837,4533.2844144832943,23088.107762220137,12672.906698580953]
["Guildford",32005.690160342347,17935.595151353613,36262.891105831259,3436.1555162505888]
["Stirling",63929.352881264669,1856.8263101861558,21823.836616181285,1226.4894443101482]
["Colchester",24252.036520320795,17068.938863242693,39773.481883302848,5004.3611971003102]
["Winchester",35992.036154345951,14188.825557913451,29937.590057244764,5121.7353623517311]
["Hastings",47752.917500076852,4642.6494595164504,26127.873707654475,6639.4551650978774]
["Bradford",16248.840028219405,31802.976646223487,32831.378238303267,1297.9078173129687]
["Ipswich",26670.267011262717,22986.245980342752,27276.43791134495,3021.62935797914]
["Warwick",22678.035767915568,30054.111134486138,20461.258191062698,5832.5231453895849]
["Swansea",28025.329729317673,12454.486873381551,33695.137086766168,3315.2062539414196]

{"sheet":"Visits and Spending","index":12,"n_rows":22,"n_cols":7,"rows_kept":22,"cut":false,"hidden":true,"merged":[[2,1,2,2],[2,3,2,4],[2,5,2,6],[1,0,1,6],[2,0,3,0]]}
[]
["Visits and spending in UK: by mode of travel, region of residence and purpose of visit 2013"]
["Region/Purpose","Air",null,"Sea",null,"Channel Tunnel"]
[null,"Visits","Spending","Visits","Spending","Visits","Spending"]
["North America"]
["Holiday",1061380.808,1045023421.7349994,104250.02799999993,33805080.550000004,237143.47100000046,121068979.63600001]
["Business",776585.58900000062,990230278.54299963,7128.304000000001,1210256.2840000002,28946.146000000001,25443394.830000002]
["Personal",935513.89499999885,551059294.8829999,11901.937,4796439.7640000004,35386.751999999993,16657258.584000003]
["Miscellaneous",320797.6980000005,264262213.42100006,11716.568000000001,18056584.246999998,3610.7490000000003,1338157.9790000001]
["All visits",3094277.98999999,2857835065.5229936,134996.83699999997,57883903.349999957,305087.11800000002,164991165.36900002]
["Europe"]
["Holiday",5663109.7499999953,3145447711.348999,1800567.9349999975,755973634.70900071,1615053.3330000013,587911427.96099985]
["Business",4044605.1019999976,2228895958.6970015,1288768.0819999999,183578492.18700013,982523.50200000114,199361956.49900004]
["Personal",5090675.9159999928,1711419995.150002,848433.50299999909,256925380.47300002,750993.78100000089,195519075.78400004]
["Miscellaneous",1471675.0760000008,1315255355.4430008,317929.5650000007,130599911.74199998,220259.79100000003,148999034.75900012]
["All visits",16270065.843999954,8412860548.8669872,4255699.084999999,1356371320.4450004,3568830.407000015,1132900620.7359998]
["Other Countries"]
["Holiday",1584008.1179999993,2397445344.9500003,207192.55200000011,121010364.37000003,453503.16000000021,240553061.48600012]
["Business",775665.99299999897,1361657627.5720003,7610.8830000000016,3424239.8,33498.028999999995,20391839.901000008]
["Personal",1562544.5529999989,1712346938.464998,25626.28100000001,24740260.914999995,65693.12099999997,50715728.158999979]
["Miscellaneous",435050.73699999962,998438618.08299971,19019.510000000006,67746642.990000024,14867.771000000001,17785019.978]
["All visits",4357269.4010000015,6480936538.3700228,259449.22599999991,216921508.07499987,567562.08100000001,331526607.49999988]

{"sheet":"4.03","index":13,"n_rows":65,"n_cols":16,"rows_kept":65,"cut":false,"hidden":true,"merged":[[3,2,3,3],[3,5,3,6],[3,8,3,9],[3,11,3,12],[3,14,3,15]]}
[4.03,"Visits to and spending in UK regions: by region of residence and purpose of visit 2013"]
[]
[]
[null,null,"London",null,null,"Other England",null,null,"Total England",null,null,"Scotland",null,null,"Wales"]
[]
[]
[null,null,"visits","spending",null,"visits","spending",null,"visits","spending",null,"visits","spending",null,"visits","spending"]
[null,null,"(thousands)","(£ million)",null,"(thousands)","(£ million)",null,"(thousands)","(£ million)",null,"(thousands)","(£ million)",null,"(thousands)","(£ million)"]
[]
[]
["North America"]
["Holiday",null,1061.6801980625878,688.01387418650017,null,403.30234491527301,245.54652145338034,null,1251.7977427184087,933.56039563988031,null,232.84937448395783,226.08016363966556,null,65.123693615006317,24.441829015075296]
["of which inclusive tour",null,192.42515709122125,73.421514786296655,null,59.770519781963628,37.739741181464112,null,214.9963037481715,111.16125596776079,null,48.1933776722395,45.991808801584931,null,15.8109224739725,4.0346855995692952]
["Business",null,555.50858435949363,703.69567921969599,null,281.46130362077577,242.42903375655217,null,752.91940646180001,946.12471297624791,null,59.236237036194531,50.155997121966081,null,13.584439852101214,10.29501290644318]
["Visiting friends or relatives",null,459.41160501540247,227.8664228178537,null,525.92465680220312,234.40124392785219,null,871.19461619852302,462.26766674570592,null,128.93048441791191,78.486043841870767,null,36.100641983312798,18.489001030282715]
["Miscellaneous",null,249.73309269446042,179.25788493687858,null,84.831661533336472,85.361681097831791,null,326.57308607973033,264.61956603471037,null,6.0296400943878901,4.5142943452208923,null,5.8375671347522209,4.7167840379874146]
["All visits",null,2326.3334801319443,1798.8338611609283,null,1295.5199668715879,807.73848023561652,null,3202.4848514584628,2606.5723413965457,null,427.04573603245223,359.23649894872318,null,120.64634258517256,57.942626989788614]
[]
["Europe"]
["Holiday",null,5588.4419397983565,2577.0060203817338,null,2601.004750486492,1106.0167032153818,null,7832.3189967989938,3683.0227235971142,null,774.00282431686958,548.26279610733479,null,234.60990566846482,83.801334542320944]
["of which inclusive tour",null,922.22101597333642,376.94985891666317,null,523.85131139786427,242.51836105014075,null,1400.4961851709159,619.46821996680353,null,117.7310799088999,87.294692221413968,null,38.286866031530195,16.068330471814313]
["Business",null,2135.5391827051085,1294.7414783246302,null,3029.0065900343752,993.49493354506274,null,5004.1426478763606,2288.2364118696928,null,295.8768608922947,178.56900264200559,null,138.12057605699442,37.626504072426044]
["Visiting friends or relatives",null,2503.0345418762568,818.89203033156139,null,3699.6504013921144,1081.2484134587437,null,5986.2614168114305,1900.1404437903052,null,430.28224028157405,151.44023647391742,null,197.04627251747377,45.984629840307242]
["Miscellaneous",null,750.83007585414566,602.1932676487188,null,951.17266641177093,854.15216759526891,null,1657.1047688065403,1456.3454352439892,null,74.605037373222345,51.389124318103562,null,34.218871596269047,17.723510292234167]
["All visits",null,10977.845740233854,5292.8327966866409,null,10280.834408324761,4034.9122178144544,null,20479.827830293307,9327.7450145010971,null,1574.7669628639596,929.66115954136126,null,603.99562583920249,185.13597874728839]
[]
["- of which EU"]
["Holiday",null,4955.1602041282895,2129.2721659692279,null,2393.1585018087917,987.00263401759946,null,7034.4493142785004,3116.274799986827,null,668.73266765429958,474.83981282972888,null,225.55066004908835,79.282494557855856]
["of which inclusive tour",null,873.85124366752643,344.6267449351306,null,500.46486229919105,225.19240223653179,null,1331.6970785806766,569.81914717166205,null,104.3206120946555,74.259975628721463,null,38.077996031530205,15.912308817100028]
["Business",null,1830.663847770222,1038.4037923672038,null,2840.1723733668177,892.22837242763319,null,4536.5485978753713,1930.6321647948369,null,236.30884846231822,116.74755079113048,null,128.20033615601216,34.292316849204482]
["Visiting friends or relatives",null,2273.0782662648057,687.96195831115574,null,3438.5789289591044,973.79468938443176,null,5517.6527832550792,1661.7566476955878,null,375.41421378549978,127.08156692299481,null,185.29788823721623,42.132473879716947]
["Miscellaneous",null,592.90456853969954,447.65810033423378,null,813.73549371030344,706.90810674820443,null,1372.9895055225556,1154.5662070824385,null,65.218167970215632,44.839720389288225,null,33.643762954455475,15.299872260208536]
["All visits",null,9651.8068867030051,4303.2960169818161,null,9485.6452978450252,3559.9338025778661,null,18461.640200931513,7863.2298195596868,null,1345.6738978723333,763.50865093314269,null,572.69264739677237,171.00715754698589]
[]
["- of which EU15"]
["Holiday",null,4556.1795222407591,1941.7199511886874,null,2193.9098842496896,906.10424624992424,null,6458.3668284236146,2847.824197438611,null,628.73338561255423,458.64246444185864,null,215.46608238649119,74.732606218511407]
["of which inclusive tour",null,806.62254097156074,321.33161952637533,null,462.51479383972372,210.16437399478599,null,1227.5192114252443,531.49599352116115,null,92.571219094655532,68.849606281064311,null,37.510316031530209,15.222577617100026]
["Business",null,1558.9031120349969,900.33005135086034,null,1860.1150298047705,733.07970064659719,null,3321.819030546495,1633.4097519974575,null,184.45428364685407,107.36825698028437,null,88.024311890137554,28.974014706402279]
["Visiting friends or relatives",null,1841.5882835151983,523.79848332630149,null,2802.1256175768331,779.57032188896142,null,4469.4649595695382,1303.3688052152625,null,313.00883679925209,104.34706795835727,null,169.26306154544625,37.641333076893858]
["Miscellaneous",null,519.57914132280325,374.8930691078898,null,702.0277837597439,540.15144174901161,null,1194.4627004506883,915.04451085690152,null,57.622351015059735,35.011637146980647,null,28.743165410522543,7.2292768779485801]
["All visits",null,8476.2500591137559,3740.741554973737,null,7558.1783153910374,2958.9057105344918,null,15444.113518990336,6699.6472655082316,null,1183.8188570737195,705.3694265274811,null,501.49662123259759,148.57723087975612]
[]
["- of which EU Other"]
["Holiday",null,398.9806818875295,187.55221478053997,null,199.24861755910337,80.89838776767543,null,576.08248585488707,268.45060254821544,null,39.999282041745495,16.197348387870203,null,10.084577662597143,4.5498883393444549]
["of which inclusive tour",null,67.228702695965438,23.295125408755311,null,37.950068459467289,15.028028241745769,null,104.17786715543274,38.323153650501084,null,11.749392999999968,5.4103693476571619,null,0.56767999999999486,0.68973120000000276]
["Business",null,271.76073573522478,138.07374101634358,null,980.05734356204709,159.14867178103577,null,1214.7295673288784,297.22241279737926,null,51.854564815464187,9.3792938108461055,null,40.176024265874595,5.3183021428021995]
["Visiting friends or relatives",null,431.48998274960809,164.16347498485422,null,636.45331138227084,194.2243674954708,null,1048.18782368554,358.38784248032493,null,62.40537698624761,22.734498964637556,null,16.03482669176999,4.4911408028230841]
["Miscellaneous",null,73.325427216896742,72.765031226344078,null,111.70770995055945,166.75666499919282,null,178.52680507186744,239.52169622553686,null,7.5958169551558772,9.8280832423075761,null,4.9005975439329355,8.0705953822599525]
["All visits",null,1175.5568275892588,562.55446200808194,null,1927.4669824539812,601.02809204337484,null,3017.5266819411736,1163.5825540514561,null,161.85504079861317,58.139224405661437,null,71.196026164174668,22.42992666722969]
[]
["Other Countries"]
["Holiday",null,1851.3442404531368,2123.1779885363144,null,614.97766939552957,455.18164704252479,null,2158.044029839994,2578.3596355788413,null,213.33898925892382,119.92307297362652,null,69.131218625851943,42.025624236475721]
["of which inclusive tour",null,368.61526438562123,182.11886040137506,null,69.886340064726241,34.090935833182272,null,400.09621926726004,216.20979623455739,null,29.250920396127494,16.901195297110089,null,12.273777610502403,4.754170741589431]
["Business",null,548.37349322661453,932.93705654333041,null,303.66817340154807,369.43206432648361,null,782.64715763409345,1302.3691208698144,null,47.611408636156618,67.924758775928495,null,11.851998540198743,9.9381331293697723]
["Visiting friends or relatives",null,810.90667311558161,718.05618939595058,null,920.27348991396389,836.74428384338455,null,1529.5737534463001,1554.8004732393338,null,162.27211023661027,163.14038615745952,null,69.297457352335854,50.877139633266012]
["Miscellaneous",null,269.34506275186499,390.61940288672247,null,214.02779895698342,636.59088346937551,null,448.93579124072107,1027.2102863560985,null,18.374269495140346,40.353776068318069,null,9.2459998763620348,7.0912511070973974]
["All visits",null,3479.9694695471994,4164.7906373623164,null,2052.947131668026,2297.9488786817687,null,4919.20073216111,6462.7395160440919,null,441.59677762683094,391.34199397533263,null,159.52667439474857,109.93214810620886]
[]
["Total World"]
["Holiday",null,8501.4663783140804,5388.1978831045453,null,3619.2847647972972,1806.7448717112861,null,11242.160769357395,7194.942754815831,null,1220.1911880597515,894.26603272062664,null,368.86481790932328,150.26878779387192]
["of which inclusive tour",null,1483.2614374501784,632.49023410433517,null,653.50817124455421,314.34903806478707,null,2015.5887081863484,946.83927216912161,null,195.17537797726689,150.18769632010901,null,66.371566116005113,24.85718681297304]
["Business",null,3239.4212602912166,2931.3742140876589,null,3614.1360670566978,1605.3560316280989,null,6539.7092119722538,4536.7302457157521,null,402.72450656464594,296.64975853990006,null,163.55701444929426,57.859650108239002]
["Visiting friends or relatives",null,3773.3528200072387,1764.8146425453644,null,5145.8485481082844,2152.3939412299796,null,8387.0297864562544,3917.2085837753484,null,721.48483493609604,393.06666647324795,null,302.44437185312239,115.350770503856]
["Miscellaneous",null,1269.9082313004703,1172.0705554723206,null,1250.0321269020919,1576.1047321624769,null,2432.6136461269907,2748.1752876347982,null,99.008946962750599,96.257194731642528,null,49.302438607383301,29.531545437318975]
["All visits",null,16784.148689912974,11256.457295209872,null,13629.301506864378,7140.5995767318354,null,28601.513413912911,18397.056871941728,null,2443.4094765232421,1680.2396524654175,null,884.16864281912353,353.01075384328618]

{"sheet":"4.05","index":14,"n_rows":81,"n_cols":27,"rows_kept":81,"cut":false,"hidden":true,"merged":[[10,24,10,26],[4,2,4,8],[4,10,4,12],[4,16,4,18],[4,20,4,22],[4,24,4,26],[7,2,7,4],[7,6,7,8],[10,2,10,4],[10,6,10,8],[10,10,10,12],[10,16,10,18],[10,20,10,22]]}
[null,null,null,null,"CAN BE WORKED OUT"]
[4.05,"Average stay and spend per visit and per day: by purpose of visit and country of residence 2013",null,null,null,null,null,null,null,null,null,null,null,null,4.05,"Average stay and spend per visit and per day: by purpose of visit and country of residence 2013"]
[]
[]
[null,null,"Holiday visits",null,null,null,null,null,null,null,"Business visits",null,null,null,null,null,"Visiting friends or relatives",null,null,null,"Miscellaneous",null,null,null,"All visits"]
[]
[]
[null,null,"total",null,null,null,"of which inclusive tour"]
[]
[]
[null,null,"average",null,null,null,"average",null,null,null,"average",null,null,null,null,null,"average",null,null,null,"average",null,null,null,"average"]
[]
[]
[null,null,"stay","spend per","spend per",null,"stay","spend per","spend per",null,"stay","spend per","spend per",null,null,null,"stay","spend per","spend per",null,"stay","spend per","spend per",null,"stay","spend per","spend per"]
[null,null,"(nights)","visit (£)","day (£)",null,"(nights)","visit (£)","day (£)",null,"(nights)","visit (£)","day (£)",null,null,null,"(nights)","visit (£)","day (£)",null,"(nights)","visit (£)","day (£)",null,"(nights)","visit (£)","day (£)"]
[]
[]
["Canada",null,8.9062725837898249,784.24772779537329,88.05566194131211,null,7.1903587776677345,756.21804346495344,105.17111410541331,null,6.4752996538336172,1195.0225208681636,184.55092192693601,null,"Canada",null,11.922138210630871,551.80221797136585,46.283829982723098,null,9.5055951065405448,479.04622984641168,50.396237634484642,null,9.8815545896554209,713.36873274186928,72.191953833728221]
["USA",null,7.2833907277533774,873.08271080601253,119.87311177459269,null,6.7356514456374965,687.81773578495529,102.11599298690503,null,5.2900803297071324,1258.6224455943136,237.92123505693402,null,"USA",null,11.002002130099058,596.18536466679029,54.188806511476514,null,9.5718606455194966,937.03374479817592,97.894628797880912,null,7.8960585959319465,911.05631870984939,115.38114967627342]
["North America",null,7.6068917321566056,855.37457874255267,112.44731867638245,null,6.8081843093643357,698.72864450876068,102.6306887061933,null,5.426482541736001,1251.3029813897381,230.59191138380228,null,"North America",null,11.285079259620678,582.53102154135149,51.619577332142896,null,9.5583857155052776,843.9031401664638,88.28929541915366,null,8.3139349756098824,869.45010394400992,104.57744816319422]
["Austria",null,6.1596895013611634,632.18010075832535,102.63181295398522,null,5.0921320350554096,662.93159894148368,130.18743315721389,null,2.9102525866093822,465.72849977990575,160.03026744922758,null,"Austria",null,5.5675792677552343,269.04133064291398,48.32285589557263,null,7.0636778242818021,674.63178730719358,95.507157048996149,null,5.2829146382077683,514.34973520879475,97.360977875517634]
["Belgium",null,3.3501612081292169,406.26996811144386,121.26878167105023,null,2.8462412130242938,361.55172640564297,127.02778835159708,null,2.1333793724668024,239.62001171610572,112.31945654327566,null,"Belgium",null,4.6236673672945718,253.55841775289377,54.839242880323674,null,1.7675854782764029,311.6999124820091,176.34220031381565,null,3.1252716166157075,324.611177498188,103.8665489976525]
["Bulgaria",null,8.301719171345594,629.46158288097342,75.823039769116448,null,5,786,157.19999999999999,null,3.217471629994999,266.05734298732648,82.69143401514313,null,"Bulgaria",null,16.080776791126329,367.32167285630328,22.842284152529139,null,9.3936964795071489,788.55014372703079,83.944605347564192,null,8.4685576788247747,397.73054776052589,46.965559289397312]
["Czech Republic",null,6.9697732516038897,356.161993615678,51.10094414243931,null,5.3460112349233873,307.40079210628249,57.500962605195085,null,6.7435272871576286,259.88220550948023,38.538022379534198,null,"Czech Republic",null,9.9454222605727836,251.15684740364628,25.253512703962503,null,14.845061682984543,907.66651910496466,61.142657301675946,null,8.2172248094773916,340.9932708212221,41.497376392566892]
["Cyprus",null,9.0304862420846685,752.30439103302911,83.307185334835452,null,4,512,128,null,6.2122039804527178,1379.6553894225017,222.08790853676354,null,"Cyprus",null,10.897753272938512,900.94779507137605,82.672801678179397,null,29.443378479544574,2000.8544415613226,67.956007254785376,null,11.888355102600528,995.1598189075803,83.708789846788235]
["Denmark",null,4.7459082063642226,683.60419358337379,144.04075339397974,null,4.0867390043212968,497.80428472944408,121.80965904675301,null,2.5981612777004619,560.84252256027594,215.86131983948945,null,"Denmark",null,5.2723686759019426,344.17801346377996,65.279580131960614,null,6.7126269042213149,1001.4946554114383,149.19563826519786,null,4.4713437937704743,625.63694330417309,139.9214581030019]
["Finland",null,4.997907269527607,580.5532397360887,116.15926595432043,null,4.7940066681337825,622.93724987994233,129.94083926096002,null,3.0880082367658566,662.02007228911327,214.38416659874667,null,"Finland",null,6.970470087578132,333.27833734465997,47.812892553485803,null,21.477712716409762,701.88289610000584,32.679592346150599,null,6.2607776464610181,555.07423000692654,88.65899115913966]
["France",null,4.1689249808657918,355.99720425892991,85.393046383146313,null,4.1849307300824101,379.43457689288948,90.666871536346221,null,2.8471828817888127,310.01065193085338,108.88329440084351,null,"France",null,6.8926583345038104,305.01466806358957,44.252109021090341,null,6.891181501715077,519.93122960142296,75.448778917232474,null,4.848140549854171,343.02966983373602,70.754893820900904]
["Germany",null,6.1191428998381081,486.88510834145819,79.567533609051608,null,4.997547138492858,508.62096026267068,101.77411961662031,null,3.5569894245350571,425.01468504453828,119.48719389293463,null,"Germany",null,6.8886561304673641,266.32970312761648,38.662069652407986,null,11.523485066930952,854.36542441027416,74.141235871607464,null,5.976230594021553,445.00506887178597,74.462499709592208]
["Greece",null,6.1044992047552711,676.83386266878972,110.87459265152349,null,4.8828620490982031,1208.2800632153385,247.45324587625637,null,4.1274775740017535,891.3469254786844,215.954395753261,null,"Greece",null,11.740063743771072,504.64712296051732,42.985041135595878,null,22.590089733572924,3307.8106475574973,146.42751253181157,null,8.9842450092708326,824.00106457163884,91.716228099451101]
["Hungary",null,5.1712700829306666,363.92861831701958,70.375094025406923,null,4.4252820368871459,368.65940172619867,83.307549361423952,null,4.096551758779496,158.67374557262798,38.733489753319354,null,"Hungary",null,7.0963930840391001,206.42966310947818,29.089378317242719,null,27.661468230990589,1288.2814665934657,46.57314123153219,null,6.2658458382671274,268.98985820113944,42.929536593184181]
["Irish Republic",null,3.9467792104838684,385.46781610362223,97.666425089019498,null,3.6741440803699041,406.07475131838225,110.52227197293242,null,2.95305682636313,390.44140694683665,132.21601543905578,null,"Irish Republic",null,5.1120293667762029,273.38976916433353,53.479694569270677,null,2.151316294689313,277.77779510657246,129.11992336612147,null,3.9642548205189194,327.56595721431296,82.629894405081316]
["Italy",null,5.796934721569392,477.56683258419008,82.38264798933244,null,5.4987528962041443,613.49927275831612,111.57062052776041,null,4.3160911979168324,545.84833523777047,126.46821167755326,null,"Italy",null,7.0254343104842913,301.70900429684269,42.945245939684071,null,16.835271544713972,1014.6351085240025,60.26841359993287,null,6.8848127582488283,498.29673205360734,72.376221336824059]
["Lithuania",null,7.8996295804983037,477.04323710348723,60.38805139435356,null,6,576,96,null,2.0365365218764131,93.911990252915459,46.113580210379602,null,"Lithuania",null,8.2404546664644585,304.32565642531625,36.930687534003049,null,42.978624866737768,1783.7168394245825,41.502417654247601,null,7.5191264177609325,321.74516410434904,42.790232033385507]
["Luxembourg",null,4.4583055849249975,584.9992234504482,131.21559576995432,null,5.4147664033482199,814.6116790854162,150.4426264042898,null,1.9251707624601782,361.49437180438537,187.77262716291787,null,"Luxembourg",null,5.5569851873088663,440.48729728817437,79.267315359084719,null,2.7300993695445301,457.26761620844792,167.49119878546222,null,3.8281363060495828,478.37199564296861,124.96211142926127]
["Malta",null,6.0363590118504638,641.62377778568487,106.29317714967937,null,4.5284216267707338,652.18613373075618,144.02062958873313,null,9.2042393150532096,907.8315051280025,98.631888421596784,null,"Malta",null,8.1876052748194361,410.41706672668795,50.126630797518388,null,14.526926789626515,784.9249595311959,54.032416552942244,null,8.4263680842416875,624.19960979847224,74.076945554491019]
["Netherlands",null,5.4987586869163287,441.09186062342906,80.216624467074169,null,3.8799920295186543,456.39802950877959,117.62859975910817,null,2.4890417889181911,365.91986268036271,147.01234198217378,null,"Netherlands",null,5.7186846740437396,261.90626918843782,45.798340722857382,null,6.1306912576058732,476.51675648796299,77.726431892453505,null,4.5947613302808232,374.58555082229162,81.524484928882629]
["Norway",null,4.2682754736600046,616.61159722060665,144.46387095345284,null,4.1342346213735484,805.46377947374742,194.82778633548912,null,2.7026721655170651,787.1996195331476,291.26715018450767,null,"Norway",null,6.5596398702072554,457.80092299289942,69.790557416444713,null,4.7516594916428119,654.93176377937482,137.83221734033438,null,4.4265107834641748,630.4115011331437,142.41725186531355]
["Poland",null,7.5365995233338818,374.70974669143897,49.718675581913203,null,4.6479443236422693,304.03438712841495,65.412656856045217,null,3.6525677615983487,237.63449774660984,65.05957267788564,null,"Poland",null,12.135527148707391,275.43509587877793,22.696590968288984,null,31.369583185437438,1566.2953287163641,49.930383819810473,null,8.7804131849959948,330.89526958520059,37.685614858152206]
["Portugal",null,5.7292289608420788,433.09821361922087,75.594502607479029,null,3.3663672574981613,361.46397728706677,107.37508704136515,null,4.3804065742028415,474.07296525717379,108.22579074031431,null,"Portugal",null,9.836255554400342,263.93037092485872,26.832402784287865,null,9.1529094584363673,624.21389593829338,68.198412622004753,null,7.2563907852208009,401.405871174244,55.317565309712002]
["Romania",null,9.3679411173696039,662.69030048212312,70.740229062007373,null,4.671977976305925,1017.4803519146706,217.78363619752756,null,3.8007812761619415,223.98037263838481,58.930087359449928,null,"Romania",null,20.302757896863824,479.42326065308123,23.613701305433878,null,17.864672319936858,1406.7288202515144,78.743611696790779,null,9.7111053122525757,410.42860102704191,42.263839988348295]
["Russia",null,7.9588306782908589,1080.5584120985109,135.76848858538079,null,7.6932716175402946,921.18993574274577,119.73968703281922,null,4.1417217445349657,888.72604293617178,214.57888717629396,null,"Russia",null,11.749273221431281,1297.1463419431966,110.40226212265918,null,17.962194299398472,1898.9736180935126,105.72058104043037,null,9.2949451925930084,1203.3791267427293,129.46597336600573]
["Slovakia",null,4.8184308172542938,324.01089794722867,67.244069747142532,null,3.9799010393430607,307.30170146860939,77.213402652678496,null,2.5091319999299024,121.21721346477455,48.310417095697233,null,"Slovakia",null,17.60961660629949,317.66704183807718,18.039407043333249,null,10.344705399468417,366.62611627476838,35.440943179842336,null,7.4159252963944873,240.25269686338945,32.396860440354857]
["Spain",null,6.4552281817384927,483.65306826307142,74.924240421322523,null,5.5495896213014371,508.71443571842724,91.667036741921891,null,4.191553212309385,649.03381052537782,154.8432711338013,null,"Spain",null,10.299513637620809,362.66483980039686,35.211841312166321,null,21.445731218243402,1195.3022146800813,55.736137066907958,null,8.5244249438961095,530.69759351099458,62.25611663001375]
["Sweden",null,4.4014463758069189,567.38710223724024,128.90923887110199,null,4.7223082133843279,769.64644610424136,162.9809854263325,null,4.7012502587692007,656.76508289271669,139.7000897086171,null,"Sweden",null,6.5606454388248512,377.55640878203275,57.548668389807247,null,8.9760280901972092,650.47539171033418,72.468065515606341,null,5.3571880672191252,562.08638734828583,104.92190684656337]
["Switzerland",null,5.5085531949903253,725.03571332565343,131.61998943479875,null,5.875967995880675,697.88781497105867,118.76984617007959,null,2.6263097409817799,600.62452247122724,228.69523464764626,null,"Switzerland",null,5.219961799085362,390.37203625490656,74.784462277733013,null,9.8889175368026851,951.25638836763187,96.194187566781437,null,4.9896205113380638,616.92293109018715,123.64125281438432]
["Turkey",null,7.6393409441240303,915.18640634890198,119.79913097776294,null,5.2504620769063122,1021.5451186356341,194.56289821210385,null,4.5445511078372922,775.53389184231685,170.65137423691246,null,"Turkey",null,11.693016345058776,616.72909590935944,52.743370718880101,null,23.315909804649088,2088.2965541680155,89.565304192059386,null,9.398559213558066,913.70165228552128,97.217204416549706]
["Rest of Europe",null,7.6357042656975471,729.25366080673371,95.505749755502606,null,4.7594783900659792,761.21793165852898,159.9372597735393,null,5.0230310326904712,590.83672677160018,117.62553783290724,null,"Rest of Europe",null,12.103503025795662,506.44651288187617,41.842969907349058,null,21.206640284587753,1550.2842510022376,73.103717995769955,null,9.8733237222685677,732.50327713420393,74.190140801531285]
["Europe",null,5.2563671336209161,482.91134359268881,91.87169223851933,null,4.4291588271360292,473.2458953042032,106.8478042387593,null,3.3712991411335365,413.53374464982284,122.6630231664283,null,"Europe",null,7.7805035553113235,323.44261167854387,41.570909823406915,null,10.656884976906719,793.51337162425955,74.46016104553901,null,5.9135745684058758,446.356421628058,75.479968412469418]
["- of which EU",null,5.2311964977055743,455.88456603804514,87.147283845674337,null,4.384206777392726,455.51941595790487,103.90007567772632,null,3.3844247708805693,381.57448437592643,112.74426533541985,null,"- of which EU",null,7.7783864709607116,306.87512120364988,39.452285168564998,null,10.897612765613912,751.97866740197207,69.003981291641139,null,5.91184068030035,417.48764582724073,70.618893235470338]
["- of which EU15",null,5.0547052479182817,455.24052028239504,90.062723334833478,null,4.3414462469786725,461.82340411598494,106.37547440265557,null,3.1945005263696502,425.84069866891429,133.30431319504447,null,"- of which EU15",null,6.8195254424057037,299.0617874431004,43.853753456721655,null,8.9337195486147145,667.69710207289893,74.73898172418383,null,5.4136522480617666,423.12915435680623,78.15964804689807]
["- of which EU Other",null,7.34253367732763,463.58918454416539,63.137495164052439,null,4.8775504728127377,382.78802596636547,78.479562251587126,null,4.0032556922654967,237.34170225959326,59.287170369394609,null,"- of which EU Other",null,12.093237662240378,342.03493214662365,28.283156396949423,null,26.185155734287942,1408.0520426153391,53.772910763008241,null,8.7128156252852413,385.76927779482816,44.276074966546624]
["Egypt",null,9.9016819366739064,1884.977072157925,190.36938211237992,null,8.5356805481260611,1574.6986729339997,184.48425571405807,null,7.9040186642771086,1973.2411683074486,249.65036801161435,null,"Egypt",null,15.506367629712154,1375.8399484966524,88.727417107045085,null,8.7672275097379355,997.64184510789005,113.79217021570265,null,11.176439641010468,1666.0761353704486,149.07038277708781]
["Morocco",null,3.8251561406771248,956.38711483672921,250.02564069644245,null,".",".",".",null,14.031182122282029,3004.7170560448249,214.14568137300597,null,"Morocco",null,9.0773004469522931,1047.813468150573,115.43227794144204,null,24.693537643891574,2348.2805444671371,95.096967406289394,null,12.106264370142283,1655.5892024726802,136.75475372534117]
["Tunisia",null,5.7768821561506574,558.9024857880911,96.748119605144879,null,".",".",".",null,5.0846363995410151,1544.6512814880077,303.78795259134785,null,"Tunisia",null,15.716221805528562,2178.2530443733876,138.59902661892531,null,3.452429634614623,1129.482891611575,327.15594846226412,null,9.3257194940975303,1473.4950304155791,158.00336170825096]
["Other North Africa",null,25.058554136485757,1145.3724857223101,45.707844095227536,null,".",".",".",null,7.240596331238156,1504.5072977759523,207.78776069659426,null,"Other North Africa",null,32.350414150118212,753.62106960295398,23.295561723131765,null,28.105927484884869,1505.5154911877439,53.565764445859237,null,21.16629117365223,1229.5302109600709,58.089071952793894]
["South Africa",null,10.194927257034681,861.89802467827303,84.54185134901752,null,3.9188882117083144,327.10492583532493,83.468807519960876,null,5.191604814269601,1357.4541356876225,261.47100641338022,null,"South Africa",null,19.094056357775809,795.99569371388577,41.688139953024006,null,7.3614066775945366,1267.9093699094144,172.23737601245054,null,12.817628951010583,970.61558490291759,75.725049352937546]
["Nigeria",null,11.654739741215073,1586.1528023659764,136.09508556907605,null,17,2241,131.8235294117647,null,8.1631103872608666,2868.9586338907347,351.45410239312156,null,"Nigeria",null,15.409046725530851,1263.9304772254679,82.025221919231001,null,11.352005747950082,2077.2416696057408,182.98455054789275,null,12.265706334105651,1756.8216810416338,143.23037199714042]
["Other Africa",null,11.610877319310161,1400.1246834568703,120.58732901503572,null,2,78,39,null,7.0971181460938064,1717.0243732226315,241.93261798349337,null,"Other Africa",null,18.438926277970591,778.47052187793292,42.218864056525327,null,14.222206966805819,1294.9810919220645,91.053455693937607,null,14.642478858341518,1125.2578034762414,76.848859702140203]
["Israel",null,6.7236681721794396,714.94861696651287,106.33312035307749,null,5.9117576915453922,656.20685158650474,111.00029565233513,null,3.5307701186617195,693.10238206168435,196.30345753701843,null,"Israel",null,8.9260240221161915,441.75788143125385,49.491002974751289,null,2.1493891479351803,243.69903565081026,113.38060205845963,null,6.1770446509552182,594.94642799588007,96.315707852925698]
["United Arab Emirates",null,12.618991676740935,2559.9535246096325,202.86514090726331,null,6.0999478827086628,676.77279097590144,110.94730709000461,null,4.9205221773512458,2412.0987271012773,490.21194096105637,null,"United Arab Emirates",null,13.594644559763362,1193.4047589048992,87.784918072596696,null,24.999114900258537,3282.3763688162462,131.29970328598716,null,12.898948210927353,2006.799991792232,155.57857578590554]
["Other Middle East",null,12.103426173114524,3334.3221211606933,275.48580653693415,null,5.8788496184350523,1332.8639122106986,226.72189266945503,null,7.3714036387670809,3673.4578920968456,498.33899649419516,null,"Other Middle East",null,23.273406530585227,1758.3886922123102,75.5535589472683,null,33.738109600146906,3512.5944387141781,104.11355231055633,null,17.228942534263872,2978.8574595148984,172.89845001170141]
["Hong Kong (China)",null,8.6596615714457847,1338.855558539211,154.60830050840897,null,4.9270218004687099,469.98255786377746,95.38877173611607,null,6.1410420247080726,1820.5232948941903,296.45185419175385,null,"Hong Kong (China)",null,16.308185632865548,1626.5585802517542,99.738782527333029,null,13.166962078877271,1320.3488200162219,100.27740735536517,null,11.211773743589244,1523.8883508675449,135.91857860482475]
["Other China",null,9.7202087238357322,1623.8427331286757,167.05842222777747,null,7.4103168304573801,1311.5986589986935,176.9962997543978,null,9.3836700899903001,1786.2919444515585,190.36175902614295,null,"Other China",null,15.822399322601267,1411.6597535276846,89.219070050344428,null,80.584690215971023,5917.5163845391799,73.432265715484391,null,22.357426768025238,2299.2213690159047,102.83926647158543]
["India",null,7.9350792073911753,629.64707556176381,79.349816064252437,null,3.0644998474547527,148.1183866026324,48.333625053254103,null,29.329108840042398,1978.475973418846,67.457759600171542,null,"India",null,34.760973351461843,544.90519272327333,15.675774875859679,null,55.921392783247555,3116.9247322004235,55.737609116455424,null,25.533930520610554,1173.8927650349997,45.973837208002642]
["Japan",null,6.345389693899115,685.18558939018726,107.98164059946875,null,4.8943578151227491,627.3997818355524,128.18837639883861,null,6.5261740753429747,1049.4075485897285,160.79980957826018,null,"Japan",null,10.102720620634789,573.42300192351809,56.759265494514665,null,37.885916975802211,2420.4624154355179,63.888183489961996,null,9.9268430779977734,942.55926141273983,94.950555177190566]
["Pakistan",null,16.244862103712855,3139.964566058426,193.28970267717872,null,".",".",".",null,17.150384666500951,1733.131194215016,101.05494587536921,null,"Pakistan",null,38.74892706733467,1121.1551506910876,28.933837283877232,null,36.925855610194581,1599.2222968912833,43.309011273113633,null,29.160070492717725,1827.2542882860846,62.662889952286399]
["Sri Lanka",null,11.41355223035962,503.57164573117689,44.120501274940082,null,".",".",".",null,10.607837060221243,914.26943861735288,86.188111056664766,null,"Sri Lanka",null,28.819496409559463,663.67854464998038,23.028804362793704,null,5.1862071922748934,838.54275803255985,161.68709173085293,null,21.418799601592795,722.98308505067052,33.754603362408155]
["Thailand",null,11.050745365742761,1750.1368507780342,158.37274254852048,null,6.3394698541340642,1339.3391957273914,211.26990529878267,null,13.068908474836263,1541.1901319478388,117.92799183767703,null,"Thailand",null,16.716537575428386,1001.9939076565399,59.940277891599351,null,29.185438473968517,3161.0423142997129,108.30888551217599,null,14.936669438477416,1566.7238113414035,104.89110827514632]
["Other Asia",null,7.1114070134816059,890.04407092096892,125.15723952146858,null,3.6852637314370122,521.44403665405343,141.49436096144041,null,5.6505801806941411,1340.9149578930887,237.30571286723426,null,"Other Asia",null,16.66734121697025,1337.1484681010743,80.22566111142099,null,34.864291683457928,2879.5766758350242,82.593867157246677,null,11.923182984675215,1280.5779472034269,107.40235630446541]
["Australia",null,11.793354605397793,1054.0640118986792,89.377793441082176,null,9.2741318378628552,999.330255969262,107.7545880779229,null,10.064088045253282,1550.8805940301775,154.10045967966755,null,"Australia",null,17.943782003559519,1161.3662621463932,64.722490605158512,null,9.778876392400548,760.00989253860303,77.719552026368703,null,13.984619355582421,1112.5511301754013,79.555338753735171]
["New Zealand",null,11.366330038948538,899.83126087448943,79.166385085693832,null,5.9026629362351093,1074.0907658988831,181.96715236868488,null,8.4871350755970507,1279.1069254315983,150.71127230075527,null,"New Zealand",null,17.134342819927401,727.44442133044879,42.455344157374057,null,15.047692037381251,523.90963532133719,34.816610681548283,null,14.406441097825287,819.0514103229026,56.853139839411263]
["Barbados",null,31,1014.9999999999999,32.741935483870968,null,".",".",".",null,".",".",".",null,"Barbados",null,37.844159332012389,1117.2245304015526,29.521716167611949,null,10.738507717430537,153.81788505413982,14.323953486057064,null,25.000921612595043,678.89537506020383,27.154813953665922]
["Jamaica",null,60,715,11.916666666666668,null,".",".",".",null,7,996.99999999999989,142.42857142857142,null,"Jamaica",null,53.385385467165058,447.90503138352943,8.3900308570220137,null,".",".",".",null,48.692996394135839,539.91856363859392,11.088218093385128]
["Other Caribbean",null,12.053424556174983,1073.0641292939081,89.025664390472002,null,".",".",".",null,4.9855929547723994,1573.7424813485902,315.65803619048847,null,"Other Caribbean",null,20.655910396660484,947.88971779162921,45.889515377878382,null,6.0266669350463893,289.5584352021362,48.046198391732986,null,13.994278550582159,951.66853375782011,68.00411541888532]
["Brazil",null,6.7648310467347619,864.4390697119992,127.78428075143803,null,5.058808395630976,584.67610883292798,115.57585563783789,null,5.7557220577526804,1504.2509584275924,261.3487835816253,null,"Brazil",null,10.763809161155818,772.83523479214909,71.799418144752948,null,28.60427231016201,2822.4550777319396,98.672500636530046,null,8.8705460510602556,1074.8319953607026,121.16863935701376]
["Mexico",null,6.0465629474000844,559.65411114085464,92.557394342763942,null,3.5748035868115786,260.60280973468696,72.899896009985412,null,5.77277551167104,865.21266327611193,149.87810655842731,null,"Mexico",null,15.636812348798824,562.22301224718058,35.955091082893823,null,3.3105339110248742,433.2427207722688,130.86793019381747,null,6.8784297134657519,567.86015351101958,82.556655685429504]
["Other Central & Sth. America",null,4.7070461512739969,548.18364360728344,116.46022282125138,null,3.4966723279239411,365.02970704251618,104.39345549408203,null,4.5924652288531655,1110.0464095494108,241.71035690707072,null,"Other Central & Sth. America",null,15.755775740272568,1014.1946462530539,64.369705622346515,null,23.444939787276315,1534.0167513071026,65.430611689590307,null,7.9334776679642705,758.87078954760909,95.654241595960187]
["Rest of the World",null,5.1153553194750678,640.05000235818466,125.12327343545431,null,5,714,142.80000000000001,null,4,65,16.25,null,"Rest of the World",null,19.965491470402796,1176.2228378874452,58.912791584975459,null,13.549246886822839,1343.3563625643515,99.146201540604963,null,9.6205693979122078,852.22251881969964,88.583376260935594]
["Other Countries",null,9.3118379247386187,1229.1192868887306,131.99534794558099,null,5.1442218241206819,579.11497282717994,112.57581663989964,null,9.8232805793659885,1696.2735985050854,172.67893193116609,null,"Other Countries",null,18.920085297463292,1080.9854838023823,57.134281733249665,null,28.168963024874667,2311.5427613953898,82.059916772732336,null,14.163290192155994,1353.3711004193933,95.554852160617742]
["Total World",null,6.2307803450524384,655.58630579854025,105.21736756762894,null,4.8222582624778951,517.55012432640626,107.3252605223316,null,4.2447657592613206,631.08681648735637,148.67412061794877,null,"Total World",null,10.125115825913529,485.07473635369024,47.908067887206109,null,13.443047742262172,1052.4184283526456,78.287189670840704,null,7.475522951841282,635.23095187575314,84.974784502439462]

{"sheet":"4.13","index":15,"n_rows":70,"n_cols":17,"rows_kept":70,"cut":false,"hidden":true,"merged":[[73,0,73,15],[74,0,74,15],[4,2,4,4],[4,6,4,8],[4,10,4,12],[4,14,4,16],[71,0,71,15],[72,0,72,15]]}
[null,null,null,null,"THIS CAN BE WORKED OUT"]
[4.13,"Visits, nights and spending in the top 50 UK towns stayed in: by area of residence 2013"]
[]
[]
[null,null,"North America",null,null,null,"Europe",null,null,null,"Other Countries",null,null,null,"Total World"]
[]
[]
[null,null,"Visits","Nights","Spend",null,"Visits","Nights","Spend",null,"Visits","Nights","Spend",null,"Visits","Nights","Spend"]
[null,null,"1000s","1000s","£mil",null,"1000s","1000s","£mil",null,"1000s","1000s","£mil",null,"1000s","1000s","£mil"]
[]
[]
["London",null,2323.8385720810011,12845.808064295765,1797.0571955669516,null,10977.266749114555,53333.655766462121,5292.7560683783631,null,3478.7165275329958,31245.027367596631,4164.4970118961965,null,16779.821848728552,97424.491198354517,11254.310275841512]
["Edinburgh",null,255.42280582244908,1071.0907249285958,125.47357916467139,null,784.02899380734743,3618.8482877208567,300.31696759585088,null,263.45663483780015,2162.1941546706284,167.53458375909,null,1302.9084344675969,6852.1331673200802,593.32513051961223]
["Manchester",null,98.496794525152296,353.90416113483309,36.728352621283186,null,681.51117081001485,2801.6628215757473,211.83169156178178,null,207.98236419131158,2410.7853186636112,159.539805180212,null,987.9903295264786,5566.3523013741915,408.09984936327697]
["Birmingham",null,70.488092942551205,531.27557432669471,38.458224690836822,null,749.36819597247245,3478.8088959740235,191.19689449184833,null,120.67913894930557,2000.6811433465421,133.50605614334435,null,940.53542786432922,6010.7656136472597,363.16117532602948]
["Liverpool",null,35.294342519565198,178.37091306287201,13.656769149220507,null,452.41769986319787,2182.515031265606,160.37579144220518,null,74.140847294693046,745.41534014903493,50.84676487110913,null,561.85288967745612,3106.301284477513,224.87932546253481]
[]
["Glasgow",null,113.75321080231491,490.01951937390839,41.229169003731528,null,301.15190894470629,1385.611985903965,92.732739699581103,null,99.712202676101569,784.63111947827133,51.450946108228322,null,514.6173224231228,2660.2626247561443,185.41285481154094]
["Oxford",null,80.119432632847051,472.39066011968714,49.993780697646862,null,276.35085815603111,1840.7507029853268,139.3225017378964,null,99.624172824250223,937.44206082876815,77.527130265057039,null,456.09446361312837,3250.5834239337823,266.84341270060031]
["Bristol",null,35.9380503533636,252.92478297788668,21.048806703661782,null,333.76088365461675,1820.9324802357983,110.55769179763833,null,58.548723182221636,613.98638435606301,35.741868909118502,null,428.24765719020201,2687.8436475697476,167.34836741041863]
["Brighton / Hove",null,31.909070301535902,180.84700941535837,9.4952341778957638,null,324.1007930220544,2147.2578349934574,136.94286863762929,null,53.025326808956102,748.88536445114698,44.34244827264245,null,409.0351901325464,3076.9902088599633,190.7805510881675]
["Cambridge",null,47.859260839269545,362.29036232630369,32.723060905999709,null,282.00560037561434,1600.8558988947459,112.56921655736711,null,74.151007077126863,775.55277003717208,79.909437354311649,null,404.01586829201079,2738.699031258222,225.20171481767846]
[]
["Leeds",null,23.848916902538377,119.71165805534336,11.819376605887202,null,229.44847499125038,1096.0835050140804,66.710327813089435,null,46.153769431759237,859.87111364805662,39.856730115730635,null,299.45116132554801,2075.6662767174803,118.38643453470728]
["Cardiff",null,52.592293571195114,226.91277453575674,19.263178650164932,null,178.91761713853876,935.74258753115532,52.69604372675866,null,65.13766547939214,407.62269199021989,38.823953256779397,null,296.64757618912603,1570.2780540571321,110.78317563370298]
["Bath",null,52.858487024595199,151.41044839552316,12.625283359977862,null,161.8255465846828,777.21235003740958,50.779791754715333,null,67.91260430094718,323.17280385924522,26.437157488205361,null,282.59663791022518,1251.795602292178,89.842232602898548]
["York",null,55.274727628766705,158.4900986809005,16.774748144921492,null,147.73125273537619,711.21121814661183,46.27626197684323,null,67.768312184120603,411.41370155092579,24.350859006758935,null,270.77429254826347,1281.1150183784382,87.401869128523657]
["Nottingham",null,19.928269802704573,80.588670752927271,5.7546537325902012,null,186.46286083920387,881.67437423085153,44.60029413900336,null,40.192794145747634,631.28769047886738,44.194786242276386,null,246.58392478765606,1593.5507354626461,94.549734113869945]
[]
["Aberdeen",null,26.985879893506134,116.81917743717464,16.662287188805955,null,178.91542672270944,951.46943235811716,121.17688752179302,null,34.756320119133775,235.60487140107696,31.441194222276284,null,240.65762673534934,1303.8934811963688,169.28036893287523]
["Inverness",null,44.21666131057215,130.57986778199671,15.696672963982534,null,155.27455597814722,522.6947638608043,41.440474365389832,null,26.705696603469075,95.601593268041896,8.3070536086940088,null,226.19691389218843,748.87622491084289,65.444200938066373]
["Southampton",null,15.452356245791036,77.330908059429532,3.6384487954969216,null,177.0684836236386,1205.3427418830252,64.315224872114285,null,25.7797640805843,250.10774032036332,18.329786142311029,null,218.30060395001394,1532.7813902628179,86.283459809922249]
["Newcastle-upon-Tyne",null,14.404862855575482,79.40461943102531,4.9750145545631694,null,134.02547431253112,535.49782866281816,47.110363906881105,null,52.552906114651449,686.90163754886146,34.609904489113077,null,200.98324328275802,1301.8040856427049,86.695282950557356]
["Reading",null,29.054893595676649,128.71992544771146,14.377246749825842,null,129.11714976851567,566.05733706975298,44.475053563381856,null,34.742854263889008,636.74751408111251,43.791708895463756,null,192.91489762808132,1331.5247765985769,102.64400920867146]
[]
["Canterbury",null,10.956381077829121,47.997001560027229,5.2342438028392504,null,147.34944173374578,727.70702051424132,40.953496778745645,null,18.90049771715023,171.23762545175418,18.217088252716866,null,177.20632052872512,946.94164752602273,64.404828834301767]
["Bournemouth",null,10.424461346220102,40.340620944256457,3.7320231843786011,null,137.00538494049033,1116.0929238703893,53.654824863190214,null,23.510139023147044,631.22706273642837,53.085973434383163,null,170.93998530985746,1787.660607551074,110.472821481952]
["Windsor",null,32.421144065875026,238.62416873008721,21.17483897577165,null,100.45900292159763,375.57721721817887,34.51220553211305,null,32.81037092314623,328.46251282520853,20.205055459414829,null,165.69051791061889,942.66389877347456,75.892099967299529]
["Coventry",null,10.773027783565695,69.101931089390973,3.3578680121479834,null,117.84131972537054,893.15694450963724,41.71381471278287,null,26.115864826260594,966.03103723652544,60.169876611829096,null,154.73021233519682,1928.2899128355537,105.24155933675995]
["Sheffield",null,15.330657450640791,59.332684406222889,4.6097547175380731,null,106.32310320301417,784.23308671188227,39.141858865758422,null,29.665357156173279,1049.6639499953767,104.25330160908022,null,151.31911780982824,1893.2297211134819,148.00491519237673]
[]
["Plymouth",null,21.005554394993798,72.595215936828268,4.5191312787847551,null,99.036108087385401,887.40469520044292,50.982432993739437,null,27.314628829431708,216.78745972129485,14.181984955316445,null,147.35629131181091,1176.787370858566,69.683549227840643]
["Leicester",null,21.361843090272128,254.15371657493878,17.481122493916995,null,99.475918283858633,982.96976934570341,43.649312087542825,null,25.263277322632018,661.79374754183982,25.27714156654848,null,146.10103869676277,1898.917233462482,86.407576148008317]
["Luton",null,11.510863023296597,75.043107537491451,5.3503129333948944,null,113.86072782515173,399.4271171522571,22.749148575024471,null,16.593829349045045,202.44011367845937,8.3224560409221109,null,141.96542019749336,676.91033836820793,36.42191754934148]
["Dover",null,4.8455274857858219,11.96086287724755,0.71128848135710321,null,122.62140749026847,290.41034003974289,20.643605002687639,null,9.9886236465295095,97.350064685224325,3.2134726646182936,null,137.45555862258379,399.72126760221477,24.568366148663038]
["Northampton",null,6.0068681281751655,29.600607614240865,2.8751114733956062,null,113.38014900303583,1075.101300670977,58.043497705886274,null,15.165196966353369,148.62594840376283,7.5591614391885829,null,134.55221409756436,1253.3278566889808,68.477770618470458]
[]
["Portsmouth / Southsea",null,9.1453063241464392,117.04023659879404,10.581598762105672,null,107.11164421524218,557.46688834209726,37.245107359944839,null,17.972394624986816,175.44229924155317,13.424049789638143,null,134.22934516437545,849.94942418244455,61.25075591168865]
["Maidstone",null,5.8059020853818479,22.251639429727526,1.873574302175075,null,101.8699895116311,651.16135297510664,25.304239298321065,null,12.154492104575688,159.63448983118761,21.497180048921752,null,119.83038370158864,833.04748223602178,48.674993649417885]
["Chester",null,14.948037754659273,31.383885252294576,3.9490529652511057,null,82.497854619460782,426.22004890398779,18.00514755449678,null,21.544687743182532,104.59236200638797,20.361397257261476,null,118.99058011730257,562.19629616267036,42.315597777009359]
["Salisbury",null,14.806613611082819,53.793179924915066,3.710888339340451,null,79.789362669476901,277.19906108655857,16.452781148972988,null,22.274261294233455,149.56216566614364,9.1136527599917319,null,116.87023757479317,480.55440667761729,29.277322248305168]
["Exeter",null,8.7017707994383002,62.647792686374672,2.1494211442363804,null,85.898547892456079,431.22783448083919,22.872055755000979,null,15.466795050268797,305.01806535004573,20.922139756653003,null,110.06711374216317,798.89369251725952,45.943616655890359]
[]
["Stratford-upon-Avon",null,16.714418243451494,57.303828040050441,5.2353234604318795,null,62.90503034295206,247.85311215579625,17.763304725304259,null,25.447109233754833,198.72140889009256,10.217753824224472,null,105.06655782015838,503.87834908593925,33.216382009960611]
["Fort William",null,8.3530135019439644,19.839843650314226,1.9001742221373119,null,84.280015756120278,183.62764315102848,18.64594362113602,null,10.020776771877026,18.345063718968646,1.7853129803755239,null,102.65380602994126,221.81255052031136,22.331430823648859]
["Derby",null,5.9031904181868793,27.047909471752099,3.0753160889514692,null,80.454187331394948,507.86915952410305,15.225941922012067,null,11.483120137637354,118.23323921094686,8.8554829738133591,null,97.840497887219186,653.15030820680204,27.156740984776896]
["Perth",null,24.706361184393611,156.6173793079908,9.5920758446793659,null,64.245974184417321,284.20194346876701,23.928648575493007,null,7.8963075525542257,52.941236322388029,4.5823211506057264,null,96.848642921365155,493.76055909914584,38.103045570778093]
["Norwich",null,9.9573566157581492,58.415521686775037,3.5998334446268991,null,71.699340262746929,330.58801043497999,17.718679103046703,null,14.140855404995767,167.21237159552214,3.3186578568740268,null,95.797552283500849,556.21590371727711,24.637170404547629]
[]
["Eastbourne",null,1.8176585273823316,18.373402184329404,0.5212506649140739,null,84.223397657411965,784.4339810496316,40.00788380184737,null,8.4247464229157369,104.27079000398382,6.0985325095673319,null,94.465802607710046,907.07817323794484,46.627666976328776]
["Guildford",null,11.035615977094963,128.33901194891854,6.5656770605317485,null,62.899074052608086,400.68651739553718,39.400768645246131,null,15.70577942107731,131.07344584224626,10.687529904011617,null,89.640469450780358,660.09897518670209,56.653975609789505]
["Stirling",null,10.301080043060209,38.975070550299485,3.2191242414762722,null,73.336107957398383,281.61580660097098,14.160882231393423,null,5.199325570211748,44.74735548062705,3.5922693643464818,null,88.836513570670334,365.33823263189754,20.972275837216177]
["Colchester",null,6.6498405757616537,37.694195559228163,3.0937836559349514,null,61.450106956755889,378.67245942765391,18.934495331323689,null,17.998870931449069,242.31849541468034,27.017815194725021,null,86.098818463966623,658.68515040156251,49.046094181983662]
["Winchester",null,9.5251219806304626,58.427871268217203,3.8921402230488749,null,61.105203375590129,274.06598258010439,20.720944916838761,null,14.60994567316445,126.44595798754877,6.3881667566907625,null,85.240271029385042,458.93981183587033,31.001251896578395]
[]
["Hastings",null,4.359335738308892,24.199890835388135,0.8253731401055765,null,72.82181624176765,676.74762810683865,25.90625061973936,null,7.9817438522690445,135.05238883992428,6.3081102200950658,null,85.162895832345583,835.99990778215101,33.039733979940003]
["Bradford",null,4.046475194671479,28.923933124656592,1.1515349069346676,null,60.988462205258223,1040.3593449586926,20.724449510422648,null,17.146165330129417,256.6649825566339,7.719858684948206,null,82.181102730059109,1325.9482606399831,29.595843102305526]
["Ipswich",null,7.1771048970591229,59.60683003212705,2.3493621467504426,null,64.327491384126745,296.40951904545386,11.27327378684573,null,8.4499839797436636,178.44582959874296,4.0781793658065837,null,79.954580260929532,534.4621786763239,17.700815299402755]
["Warwick",null,8.5225039930010205,63.929203266438122,5.0459240391774891,null,57.869217460674761,226.62828518267344,21.029041998440391,null,12.634206785178209,192.79881342483392,23.742434130462819,null,79.025928238853993,483.35630187394543,49.817400168080695]
["Swansea",null,8.603098943962781,141.79015265218356,3.7823329306556408,null,53.968882870160073,349.08160002220598,23.053291970195165,null,14.918262026813091,166.83440466068555,16.893717122011616,null,77.490243840935932,657.70615733507509,43.729342022862419]

{"sheet":"4.14","index":16,"n_rows":69,"n_cols":17,"rows_kept":69,"cut":false,"hidden":true,"merged":[[3,2,3,4],[3,6,3,8],[3,10,3,12],[3,14,3,16]]}
[4.1399999999999997,"Average stay, spend per visit and per day in the top 50 towns stayed in: by area of residence 2013"]
[]
[]
[null,null,"North America",null,null,null,"Europe",null,null,null,"Other Countries",null,null,null,"Total World"]
[]
[]
[null,null,"stay","spend per","spend per",null,"stay","spend per","spend per",null,"stay","spend per","spend per",null,"stay","spend per","spend per"]
[null,null,"nights","visit (£s)","day (£s)",null,"nights","visit (£s)","day (£s)",null,"nights","visit (£s)","day (£s)",null,"nights","visit (£s)","day (£s)"]
[]
[]
["London",null,5.527840108442784,773.3141265306067,139.89444545429384,null,4.8585551381234406,482.15609489541515,99.238576323256936,null,8.9817687415176337,1197.1360641016463,133.28511327261896,null,5.8060503905610066,670.70499182291837,115.51828639194981]
["Edinburgh",null,4.1934028618929915,491.23874730235048,117.14561263989665,null,4.6157072204017044,383.04319096347751,82.986890778167975,null,8.207021075790351,635.90952591584721,77.483598499789153,null,5.2591056946530896,455.38513284861858,86.589842320835402]
["Manchester",null,3.593052574360271,372.88881123846295,103.78050516136808,null,4.1109565647263144,310.82644076106305,75.609273867809932,null,11.591296829600715,767.08333324579428,66.177524786259653,null,5.6340149645412199,413.06057070302501,73.315490516568175]
["Birmingham",null,7.537096722984006,545.59888181654765,72.388467584974819,null,4.6423225787684954,255.14412743888565,54.960447730577499,null,16.578516890039964,1106.289432504379,66.73030162119116,null,6.3907912828928577,386.12173934867974,60.418455595986501]
["Liverpool",null,5.0538103369964524,386.93932722078512,76.563879809298186,null,4.8241150421956416,354.48611203916124,73.482101678450206,null,10.054043989896394,685.81310743596941,68.21266230038016,null,5.528673682288531,400.24591773770476,72.394563459210616]
[]
["Glasgow",null,4.3077423126586272,362.44400235331648,84.137809564013907,null,4.6010400224903556,307.92678693133411,66.925474550570399,null,7.8689578448789703,515.99447938541812,65.573420211066647,null,5.1693996856344713,360.29268105183002,69.697199474257545]
["Oxford",null,5.8960809456109189,623.99069807130172,105.83143342626673,null,6.6609190768136362,504.15078378093261,75.68787099303745,null,9.4097851380160087,778.19597460372199,82.700716667777115,null,7.1269960134640327,585.06172293059035,82.090928888597006]
["Bristol",null,7.0377992264740188,585.69695619817435,83.221606265061382,null,5.4557995541506896,331.24819957046225,60.714877128954207,null,10.486759590728367,610.4636782236704,58.21280376861106,null,6.276376770406868,390.77474120563022,62.261198697970791]
["Brighton / Hove",null,5.6675737558750976,297.57163365047097,52.504236639532643,null,6.6252779419991761,422.53172959163544,63.775698663615103,null,14.123163580854319,836.25035320202699,59.211263001702179,null,7.5225562080926967,466.41598495803191,62.002326344370275]
["Cambridge",null,7.5699113603743067,683.73519214801036,90.322747466649588,null,5.6766812317290967,399.17369161261956,70.318144584460441,null,10.459099621270074,1077.6581533302069,103.03546121108123,null,6.7786917450449513,557.40809332496144,82.229449913017845]
[]
["Leeds",null,5.0195846857347961,495.59385250863102,98.732043293753719,null,4.7770354762910392,290.74208410246928,60.862450267630351,null,18.630571765528732,863.56392135339877,46.351981690181425,null,6.9315686321914844,395.34471668321095,57.035389485600291]
["Cardiff",null,4.3145632017090287,366.27378922138143,84.892438028558217,null,5.2300192820397049,294.5268586153552,56.314679302767289,null,6.2578646162746052,596.02924008786101,95.244828169946203,null,5.2934127230353969,373.45046622957665,70.550037521999471]
["Bath",null,2.8644491531714,238.85063819748157,83.384492244533646,null,4.802779081797798,313.79342029994274,65.335801409062981,null,4.7586572063580537,389.28204506857116,81.805019396742949,null,4.4296195862381289,317.91684878940237,71.770688791674417]
["York",null,2.8673157784755374,303.47952607895593,105.84098492294649,null,4.8142231584576756,313.24625710536446,65.066833587689089,null,6.070886057087427,359.32515097321254,59.188254827105524,null,4.7313022455781661,322.78495977584333,68.223280403934311]
["Nottingham",null,4.0439371581566075,288.76835719121016,71.40772615834679,null,4.7284181432310151,239.1913002850707,50.585902735248972,null,15.706489282374442,1099.5698901155436,70.007362584168462,null,6.4625086036525721,383.43835347454524,59.332741662862638]
[]
["Aberdeen",null,4.328900072859434,617.44465085296542,142.63314940534428,null,5.3179843112843699,677.28585366536333,127.357625374752,null,6.7787634189550934,904.61804110750859,133.44882911505269,null,5.4180434623426983,703.4074557671612,129.82683890524129]
["Inverness",null,2.9531824409993441,354.99453144440554,120.20745028007038,null,3.3662615266751525,266.88515774098892,79.282359860076184,null,3.5798202416342599,311.05923698747182,86.892418052105057,null,3.3107269768842982,289.32402220685844,87.389876672687535]
["Southampton",null,5.0044735462588879,235.46239405967449,47.050382399502396,null,6.807212199574697,363.22231690207019,53.358453688980596,null,9.7017078798144922,711.01450288739738,73.287560468270129,null,7.0214253306133374,395.25066925458106,56.292084675641632]
["Newcastle-upon-Tyne",null,5.5123481720821319,345.37049081571524,62.653968877524903,null,3.9954928823016309,351.50305677729193,87.974892493064885,null,13.070668937894515,658.5726089744071,50.385532072124619,null,6.4771772232336353,431.35577640464305,66.596259688150866]
["Reading",null,4.4302322093812423,494.8304733067468,111.69402638961409,null,4.384060042253056,344.45504445472812,78.569873846368623,null,18.327438190446387,1260.4522519319876,68.774055535433661,null,6.9021355684287791,532.06885767089807,77.087569839202615]
[]
["Canterbury",null,4.3807349542771901,477.73473427563135,109.0535581955691,null,4.9386479646741872,277.93452283821262,56.277451809940565,null,9.0599532358544135,963.8417212784168,106.38484506344368,null,5.3437238846823396,363.44543830117931,68.013513823756355]
["Bournemouth",null,3.8698038780568669,358.00633341422753,92.512784806549988,null,8.1463434766098839,391.62566410433965,48.073797186282576,null,26.849142070786996,2258.0033823754534,84.099647445802631,null,10.45782591071737,646.26670747456444,61.797424530872959]
["Windsor",null,7.3601402913246297,653.11819141074943,88.737193254397269,null,3.7386118346336255,343.54517294032678,91.891105077506211,null,10.0109356762405,615.81307650384042,61.514037890122815,null,5.6893050408713846,458.03526311770736,80.508121787675108]
["Coventry",null,6.4143463172726891,311.69213331747153,48.592969244292327,null,7.5793189230326128,353.98292220417261,46.703790379959116,null,36.990199009804215,2303.9588009862023,62.285655732091094,null,12.462271483595201,680.16166816065584,54.577664196771146]
["Sheffield",null,3.8701983001872433,300.68865163674991,77.693344969481885,null,7.3759424159626104,368.14067391374618,49.911001625641262,null,35.383492754508922,3514.3113585398182,99.320646012030252,null,12.511503823943888,978.09792532879635,78.175888293856531]
[]
["Plymouth",null,3.4560009496407154,215.13982415345291,62.251089420510361,null,8.9604156740229879,514.78631358125085,57.45116435542834,null,7.936679684539766,519.20840820781189,65.418843753919219,null,7.9860001930181861,472.89157868657196,59.215072283619591]
["Leicester",null,11.897555632298259,818.33399955445066,68.781691369689568,null,9.8814847483062049,438.79275346810789,44.40554882638682,null,26.195878669667859,1000.5487903940333,38.19489328878921,null,12.997287701723623,591.42342120749686,45.503603119369721]
["Luton",null,6.5193293835234822,464.80554260497297,71.296526875861105,null,3.5080323548048145,199.79802526784135,56.954441994865242,null,12.199722524572639,501.53920869392687,41.110706221697114,null,4.7681353489218212,256.55485327816876,53.806118011348261]
["Dover",null,2.4684336044598458,146.79278642906101,59.467990617143997,null,2.3683494259580291,168.35237357984138,71.084263046083507,null,9.7460939695178173,321.7132588366963,33.009455874619782,null,2.9080036602938879,178.73679605872616,61.463745214358745]
["Northampton",null,4.9277938157822136,478.63735511520878,97.130150531517771,null,9.4822710159094115,511.93703850514538,53.988863811866835,null,9.8004627789217231,498.4545506372188,50.86030750601558,null,9.3148066354388455,508.93083460385833,54.636757854703568]
[]
["Portsmouth / Southsea",null,12.797847600771075,1157.0524143261312,90.409922857373161,null,5.2045404813491674,347.722300715507,66.81133559467817,null,9.761765357502096,746.92605352515682,76.515468890176749,null,6.3320686183904717,456.31419744081893,72.064000714636606]
["Maidstone",null,3.8325895102077077,322.70167057973248,84.199382615917983,null,6.3920822618790947,248.39738788263966,38.860167580136512,null,13.133785308157098,1768.6613199435055,134.66500924489986,null,6.9518886321063968,406.19909697220288,58.430035126889827]
["Chester",null,2.0995321103274764,264.18537536943228,125.83059533594165,null,5.1664379742966657,218.24988828557326,42.243783699984277,null,4.8546705922662783,945.07738984077457,194.67384488379662,null,4.724712625221672,355.62140915099371,75.268368123089573]
["Salisbury",null,3.633050833760572,250.62370348901612,68.98436464474004,null,3.4741355465494896,206.20268916205961,59.353668387193494,null,6.7145735470412005,409.15622922817869,60.935549571644025,null,4.1118630084933132,250.51136076940571,60.924053221607494]
["Exeter",null,7.199430337836362,247.0096252564048,34.309606964075208,null,5.0201993521558839,266.26824685833469,53.039377160189453,null,19.720831908530709,1352.7133248131711,68.593116714717468,null,7.258241497898287,417.4145672931445,57.509049184160112]
[]
["Stratford-upon-Avon",null,3.4284069720764219,313.22199697156765,91.360798039056647,null,3.9401159303878464,282.38289733683405,71.668677350069132,null,7.8091938484900485,401.52905897346193,51.417478777415646,null,4.7958014380600913,316.14609538095687,65.92143137369726]
["Fort William",null,2.3751719838232006,227.48367660307167,95.775665152845946,null,2.1787803609623047,221.238017741851,101.54213876066723,null,1.8307027625296926,178.16113670807886,97.318439866170905,null,2.1607825281764499,217.54118709573615,100.67703910921836]
["Derby",null,4.5819137713093898,520.958307473339,113.69884582626331,null,6.3125261266037498,189.24983803882859,29.980048279126617,null,10.296264237750394,771.17393771649336,74.8984213991953,null,6.6756641913217658,277.56135313293777,41.578087989171493]
["Perth",null,6.339152015915726,388.24316430452086,61.245283806060769,null,4.4236537320294751,372.45366545156742,84.195935761159546,null,6.7045560181179971,580.31188883004927,86.554857213788438,null,5.0982702927499721,393.42880211254283,77.169074906056039]
["Norwich",null,5.8665692051571963,361.52500945179912,61.624604911161519,null,4.6107538677973681,247.12471604502136,53.597464347641882,null,11.824770624303842,234.68579246638723,19.84696362600301,null,5.8061598700478889,257.1795397406085,44.294257391587692]
[]
["Eastbourne",null,10.108280464972445,286.77040107458674,28.369850051976023,null,9.3137299475901472,475.0210145235875,51.002231887397095,null,12.376727413463982,723.88321302811141,58.48744897141691,null,9.6021856396519052,493.59308542542516,51.404243153470084]
["Guildford",null,11.629528629420715,594.9533831332277,51.158856226390597,null,6.370308679908506,626.41253847857547,98.33315306277629,null,8.3455549914539358,680.48389178755735,81.538482759312046,null,7.363850047094501,632.01337472799582,85.82648623831831]
["Stirling",null,3.7835906902360996,312.50356545331204,82.594442961220921,null,3.8400702524950492,193.0956335945672,50.284401299456739,null,8.6063768995340428,690.91064135846818,80.278919854866544,null,4.1124782811435674,236.07720512953856,57.405094687549806]
["Colchester",null,5.6684359767393033,465.24177845881644,82.07586367173559,null,6.1622750257234866,308.12794751762448,50.002303732207807,null,13.462983113639758,1501.0838900743117,111.49712343867667,null,7.6503390191960658,569.64886460677781,74.460604056555809]
["Winchester",null,6.1340811579139372,408.61841254774737,66.614445102436392,null,4.4851496671327062,339.10278948709328,75.605679777432471,null,8.6547863227037674,437.2478104709553,50.520924973495873,null,5.3840726489203572,363.69255426101677,67.549711524406405]
[]
["Hastings",null,5.5512794352416517,189.33461188877411,34.106481955638067,null,9.2931989757031577,355.74848248402492,38.280519271579216,null,16.920160724217137,790.31729617604822,46.708616369400033,null,9.8164805178528365,387.95925921757151,39.521217254188571]
["Bradford",null,7.1479328880464914,284.57728060486909,39.81252832980126,null,17.058297706496301,339.80934690030364,19.920472297238327,null,14.969235255513347,450.23820407136702,30.077568852793529,null,16.134466642475406,360.12954461707841,22.320511275470718]
["Ipswich",null,8.3051356900957973,327.34120239946787,39.414311170115525,null,4.6078202750899591,175.24814887507782,38.032765692376408,null,21.117889693816466,482.62569202294492,22.853878821247118,null,6.6845723776189123,221.38588235516517,33.118929656054412]
["Warwick",null,7.5012230347957631,592.07059842053218,78.929875258222154,null,3.9162147878823403,363.38908527198862,92.790897577016736,null,15.260064735604566,1879.2184213983423,123.1461631361089,null,6.1164267556973515,630.39310360909371,103.06558531448006]
["Swansea",null,16.481288146951364,439.64773104346199,26.675568506748434,null,6.4682013311640478,427.15896168644906,66.039837014407766,null,11.18323329894786,1132.4185814438688,101.26039144246494,null,8.4875995316926236,564.32061451020274,66.487657953586805]

{"sheet":"4.15","index":17,"n_rows":71,"n_cols":17,"rows_kept":71,"cut":false,"hidden":true,"merged":[[70,0,70,15],[71,0,71,15],[72,0,72,15],[73,0,73,15]]}
[4.1500000000000004,"Visits in the top 50 UK towns stayed in: by age group"]
[]
[]
[null,null,"Age 0-15",null,"Age 16-24",null,"Age 25-34",null,"Age 35-44",null,"Age 45-54",null,"Age 55-64",null,"Age 65 and over",null,"Total"]
[]
[]
[null,null,"visits",null,"visits",null,"visits",null,"visits",null,"visits",null,"visits",null,"visits",null,"visits"]
[null,null,"(thousands)",null,"(thousands)",null,"(thousands)",null,"(thousands)",null,"(thousands)",null,"(thousands)",null,"(thousands)",null,"(thousands)"]
[]
[]
["London",null,553.97793194381052,null,2089.2760839389084,null,3916.9046803273463,null,3953.0741509857116,null,3560.563467714685,null,1859.4339098874261,null,849.6809129122995,null,16784.14868991301]
["Edinburgh",null,34.396362922378046,null,146.71810018365031,null,297.91311457546118,null,237.45307092029671,null,271.16556551670163,null,193.55169134538255,null,121.23631263490425,null,1302.9088580987745]
["Manchester",null,43.022246876965589,null,123.90285602280424,null,256.43681284748902,null,244.91430774745118,null,192.23606507478925,null,89.119170298196693,null,38.357242965666153,null,987.98870183336214]
["Birmingham",null,30.089788798740663,null,69.721923333171731,null,210.76574341488453,null,255.1305401362894,null,213.69209787349342,null,118.41122583225642,null,42.928163144320798,null,940.739482533157]
["Liverpool",null,28.084644567489164,null,94.64786031783153,null,133.58358870248273,null,124.29915989667964,null,101.20871081128138,null,54.086756409423359,null,25.467003264758286,null,561.85236396994617]
[]
["Glasgow",null,9.5413920367286842,null,66.562795503295348,null,115.98507957478226,null,103.1970215476456,null,95.485100715718204,null,80.50605974704979,null,43.733563731784137,null,515.01101285700406]
["Oxford",null,21.883292302628703,null,61.593515614794541,null,76.428530106847958,null,89.982999489325607,null,108.74359097184882,null,61.541440225713046,null,35.924568748663695,null,456.09793745982239]
["Bristol",null,12.878145034917475,null,54.827511457316255,null,93.572806584662217,null,87.259183256085976,null,93.100511926640152,null,52.227067005178938,null,33.555957047010516,null,428.24724390562335]
["Brighton / Hove",null,38.143722841832485,null,71.697343021252408,null,75.506514643465238,null,47.183060307956659,null,68.949305240541946,null,63.543478761392493,null,44.200318039758393,null,409.22374285619958]
["Cambridge",null,18.768459416190733,null,47.353811556619362,null,87.110898976406247,null,82.151009666040821,null,75.273614834183064,null,61.1220387289789,null,32.23577823874691,null,404.01561141716599]
[]
["Leeds",null,9.6868909408702493,null,33.961616532656699,null,76.184373643858635,null,65.75273512707561,null,58.197354563828945,null,34.890554740976143,null,20.777562047096218,null,299.45108759636253]
["Cardiff",null,16.119435805012657,null,30.165019691300529,null,51.618138555986945,null,59.604355335885515,null,53.717278225915706,null,53.148606826254976,null,32.181879314640248,null,297.02935375499663]
["Bath",null,14.583053720691458,null,36.26628775098888,null,34.445237554821389,null,37.98546522823829,null,69.38473554002185,null,53.458791728651221,null,36.001101575913339,null,282.59931309932642]
["York",null,16.860961007568733,null,26.28845851401644,null,31.058925491759549,null,44.737648909090595,null,49.098265374927109,null,48.963437117649171,null,53.075899273213118,null,270.95981953187572]
["Nottingham",null,5.2720369211438252,null,23.333507880129748,null,64.179835232471348,null,52.619002451451642,null,62.698256126138219,null,26.867990310743384,null,11.398712021926983,null,246.77092478765618]
[]
["Aberdeen",null,2.6195472861155831,null,16.454430394604763,null,46.892842339555799,null,46.73541208285755,null,72.022847284998775,null,38.678868368301167,null,17.253657757313036,null,240.65760551374666]
["Inverness",null,10.395982007054968,null,20.157161511353422,null,27.120109107134589,null,43.083766079556646,null,62.197561916585521,null,43.186289643638545,null,20.055845550468202,null,226.19671581579192]
["Southampton",null,6.8930783065573715,null,20.386556357444874,null,33.52228122860258,null,55.999993912372105,null,55.313025281702416,null,33.448988083770864,null,15.418022122066345,null,220.98194529251654]
["Newcastle-upon-Tyne",null,6.4947915421427362,null,34.192229589878011,null,43.293621849883095,null,40.557906071985606,null,37.691053437649977,null,25.774487170013693,null,12.978828415980393,null,200.9829180775335]
["Reading",null,6.9748704552117751,null,11.638862477473722,null,38.223723653517382,null,47.563154738543616,null,50.456052037837551,null,27.107570639944459,null,10.950590726189965,null,192.91482472871849]
[]
["Canterbury",null,16.70146963206998,null,28.385995600305144,null,14.763061617336552,null,29.936548524103806,null,44.34270896663029,null,25.800573808120308,null,17.276609191173296,null,177.20696733973938]
["Bournemouth",null,11.684019170645929,null,22.504958737213709,null,32.544961479752423,null,26.264207237095317,null,29.27491036612123,null,33.910088352664964,null,14.962149009084149,null,171.14529435257774]
["Windsor",null,6.1648575805212751,null,10.302025957578794,null,26.465995725180157,null,36.951872710079087,null,45.876756374666812,null,23.701337640519878,null,16.230315652229226,null,165.69316164077523]
["Coventry",null,6.2567062131879414,null,19.811739382870833,null,34.314087258459224,null,19.353614398524499,null,31.314133739440766,null,25.18718326862901,null,18.492748074084581,null,154.73021233519685]
["Sheffield",null,7.5754218358855177,null,24.631648115882271,null,30.387164059720153,null,27.466717379187426,null,34.376975696766912,null,18.733264082995088,null,8.1479266393908674,null,151.31911780982824]
[]
["Plymouth",null,13.088017447962599,null,14.693836375371511,null,11.638355197602165,null,20.46446325246087,null,31.282465960711107,null,28.238182116517134,null,28.139288400559714,null,147.54460875118511]
["Leicester",null,2.0571036106478808,null,22.248521916923437,null,28.601652404146641,null,27.240501262641434,null,37.785980872863846,null,17.146702075098588,null,11.020569946224375,null,146.10103208854622]
["Luton",null,5.8517689647519022,null,12.106696888819126,null,31.783155861673606,null,43.789187045439512,null,25.507518207986312,null,13.091170364895435,null,9.8359228639275038,null,141.96542019749339]
["Dover",null,4.0279651632413103,null,4.101382004891029,null,13.787255319542929,null,31.979816572366776,null,35.8690504171499,null,34.881431659255739,null,12.808119443890114,null,137.45502058033779]
["Northampton",null,4.1814215144289371,null,9.3357886273662274,null,23.728993920915801,null,36.248394453387348,null,27.177683559854465,null,21.23103694316346,null,12.648895078448138,null,134.55221409756439]
[]
["Portsmouth / Southsea",null,3.4389334868298009,null,10.288617269456081,null,17.063392442775491,null,27.642087563670106,null,31.973002471625847,null,31.301970742040737,null,12.521341187977393,null,134.22934516437545]
["Maidstone",null,4.3491885776919839,null,6.8114354421638312,null,8.7746998519017509,null,41.602997107931508,null,29.202379481207629,null,17.480037579901808,null,11.60950254887244,null,119.83024058967095]
["Chester",null,6.161846229900541,null,7.9762916215565829,null,24.735845980879507,null,16.53301567626561,null,25.459661218334279,null,19.433581915445409,null,18.689880729121693,null,118.99012337150363]
["Salisbury",null,14.932426238541082,null,9.5864024601686175,null,17.157686639153862,null,22.527971077117062,null,24.677772464282349,null,19.074475646592351,null,8.4384688212419459,null,116.86984334709724]
["Exeter",null,3.8652012191824694,null,9.2009841275594617,null,18.915056772179234,null,18.79066542579913,null,24.885686762985909,null,18.411796686613584,null,15.997554236391558,null,110.06694523071135]
[]
["Stratford-upon-Avon",null,7.8081547643897604,null,12.561812186145769,null,15.000445920348414,null,9.2040543050449433,null,19.956118428704887,null,26.510950842819017,null,14.024153689281681,null,105.06569013673446]
["Fort William",null,4.5332815531497763,null,5.0098253360682117,null,16.407154259122155,null,7.3445028873546327,null,45.978187475883772,null,15.624694006745599,null,7.2815205116172201,null,102.65380602994136]
["Derby",null,2.4133978061072376,null,6.0669163929372703,null,17.538508165486441,null,30.528058931719197,null,26.310876335361723,null,8.2170726469091875,null,6.7656676086981786,null,97.840497887219243]
["Perth",null,11.846868311618419,null,1.901378432952056,null,21.300970447977139,null,17.115895796927347,null,20.078801660941185,null,16.685032704683188,null,7.9194647370480231,null,96.848412092147342]
["Norwich",null,3.439883238723779,null,5.5768274814316863,null,16.675464311958681,null,20.863578085287887,null,32.236342060532031,null,10.704873343260866,null,6.3004998647767749,null,95.797468385971712]
[]
["Eastbourne",null,14.920515001761224,null,15.987578575282486,null,4.6564987630123307,null,15.502062062486024,null,19.843461249143992,null,14.828287017328197,null,8.7273999386959513,null,94.465802607710202]
["Guildford",null,16.103751873452147,null,2.9841543882849844,null,9.5319274864583132,null,23.540199754277815,null,15.909228652577225,null,15.357460973849872,null,6.2136088048774454,null,89.640331933777787]
["Stirling",null,5.8071800393406532,null,5.3941626301930548,null,11.493862219451632,null,21.483524198425108,null,25.965846622213235,null,11.744030682816241,null,6.9478988595023266,null,88.836505251942256]
["Colchester",null,1.8037308706505502,null,4.5332838346791489,null,15.735582517839529,null,18.385877262509247,null,25.984872081401697,null,13.243695288999444,null,6.4117766078870115,null,86.098818463966623]
["Winchester",null,1.2372350000000292,null,8.0683619709226946,null,12.388114709467269,null,20.117314848013066,null,18.265197400240687,null,14.936061922836286,null,10.227901280375868,null,85.24018713185589]
[]
["Hastings",null,11.427471397632313,null,15.3736970902,null,5.9630498201226976,null,11.221364115996627,null,21.254131519826785,null,15.853630503499454,null,4.0695513850677676,null,85.162895832345654]
["Bradford",null,3.0244977598273706,null,8.1284698691566533,null,14.928202854839713,null,16.589792409932421,null,21.519226541420473,null,15.407057805131505,null,2.5838554897509765,null,82.181102730059095]
["Ipswich",null,2.3732750265862461,null,1.1825770000000202,null,12.273719578196848,null,23.032975957921995,null,14.996243438273574,null,21.082507984305533,null,5.0132812756453466,null,79.954580260929561]
["Warwick",null,1.4500233031168028,null,4.4209360154637274,null,17.019283368952987,null,19.41646926160238,null,13.304131195669479,null,9.844929071234084,null,13.570156022814537,null,79.025928238853993]
["Swansea",null,6.1275269385942126,null,9.3761446490952789,null,19.479403430186871,null,13.063525870264169,null,14.00110271772281,null,10.370124304286486,null,5.0723320332569877,null,77.490159943406809]
[]
["Please note: Totals of age categories may not sum to totals presented because of cases where age is unknown"]

{"sheet":"Ref.Curr","index":18,"n_rows":58,"n_cols":4,"rows_kept":58,"cut":false,"hidden":true,"merged":[]}
["Australia","Oceania","Australian Dollar","English 79%, native and other languages"]
["Austria","European Union","Euro","German (official nationwide); Slovene, Croatian, Hungarian (each official in one region)"]
["Barbados","The Caribbean","Dollar","English"]
["Belgium","European Union","Euro","Dutch (Flemish) 60%, French 40%, German less than 1% (all official)"]
["Brazil","Central and South America","Real","Portuguese (official), Spanish, English, French"]
["Bulgaria","European Union","Lev","Bulgarian 85%, Turkish 10%, Roma 4%"]
["Canada","North America","Canadian Dollar","English 59.3%, French 23.2% (both official); other 17.5%"]
["Cyprus","European Union","Euro","Greek, Turkish (both official); English"]
["Czech Republic","European Union","Koruna","Czech"]
["Denmark","European Union","Kroner","Danish, Faroese, Greenlandic (Inuit dialect), German; English is the predominant second language"]
["Egypt","Northern Africa","Pound","Arabic (official), English and French widely understood by educated classes"]
["Europe","Europe",null,"n/a"]
["Finland","European Union","Euro","Finnish 92%, Swedish 6% (both official); small Sami- (Lapp) and Russian-speaking minorities"]
["France","European Union","Euro","French 100%, rapidly declining regional dialects (Provençal, Breton, Alsatian, Corsican, Catalan, Basque, Flemish)"]
["Germany","European Union","Euro","German"]
["Greece","European Union","Euro","Greek 99% (official), English, French"]
["Hong Kong (China)","Asia","Dollar","Yue (Cantonese), English"]
["Hungary","European Union","Forint","Magyar (Hungarian) 94%, other 6%"]
["India","Asia","Rupee","Hindi 30%, English, Bengali, Gujarati, Kashmiri, Malayalam, Marathi, Oriya, Punjabi, Tamil, Telugu, Urdu, Kannada, Assamese, Sanskrit, Sindhi (all official); Hindi/Urdu; 1,600+ dialects"]
["Irish Republic","European Union","Euro","English, Irish (Gaelic) (both official)"]
["Israel","Middle East","Shekel","Hebrew (official), Arabic, English"]
["Italy","European Union","Euro","Italian (official); German-, French-, and Slovene-speaking minorities"]
["Jamaica","The Caribbean","Dollar","English, Jamaican Creole"]
["Japan","Asia","Yen","Japanese"]
["Lithuania","European Union","Euro","Lithuanian 82% (official), Russian 8%, Polish 6% (2001)"]
["Luxembourg","European Union","Euro","Luxermbourgish (national) French, German (both administrative)"]
["Malta","European Union","Euro","Maltese and English (both official)"]
["Mexico","Central and South America","Peso","Spanish, various Mayan, Nahuatl, and other regional indigenous languages"]
["Morocco","Northern Africa","Dirham","Arabic (official), Berber dialects, French often used for business, government, and diplomacy"]
["Netherlands","European Union","Euro","Dutch, Frisian (both official)"]
["New Zealand","Oceania","New Zealand Dollar","English, Maori (both official)"]
["Nigeria","Western Africa",null,"English (official), Hausa, Yoruba, Ibo, Fulani, and more than 200 others"]
["Norway","Europe","Krone","Bokmål Norwegian, Nynorsk Norwegian (both official); small Sami- and Finnish-speaking minorities (Sami is official in six municipalities)"]
["Other Africa","Other Africa",null,"n/a"]
["Other Asia","Asia",null,"n/a"]
["Other Caribbean","The Caribbean",null,"n/a"]
["Other Central & Sth. America","Central and South America",null,"n/a"]
["Other China","Asia","Yuan Renminbi","n/a"]
["Other Middle East","Middle East",null,"n/a"]
["Other North Africa","Northern Africa",null,"n/a"]
["Pakistan","Asia","Rupee","Urdu 8%, English (both official); Punjabi 48%, Sindhi 12%, Siraiki (a Punjabi variant) 10%, Pashtu 8%, Balochi 3%, Hindko 2%, Brahui 1%, Burushaski, and others 8%"]
["Poland","European Union","Zloty","Polish 98% (2002)"]
["Portugal","European Union","Euro","Portuguese (official), Mirandese (official, but locally used)"]
["Rest of Europe","Europe",null,"n/a"]
["Rest of the World","Rest of World",null,"n/a"]
["Romania","European Union","Leu","Romanian (official), Hungarian, German"]
["Russia","Europe","Ruble","Russian, others"]
["Slovakia","European Union","Euro","Slovak 84% (official), Hungarian 11%, Roma 2%, Ukrainian 1% (2001)"]
["South Africa","South Africa",null,"IsiZulu 23.8%, IsiXhosa 17.6%, Afrikaans 13.3%, Sepedi 9.4%, English 8.2%, Setswana 8.2%, Sesotho 7.9%, Xitsonga 4.4%, other 7.2%"]
["Spain","European Union","Euro","Castilian Spanish 74% (official nationwide); Catalan 17%, Galician 7%, Basque 2% (each official regionally)"]
["Sri Lanka","Asia","Rupee","Sinhala 74% (official and national), Tamil 18% (national), other 8%; English is commonly used in government and spoken competently by about 10%"]
["Sweden","European Union","Krona","Swedish, small Sami- and Finnish-speaking minorities"]
["Switzerland","Europe","Franc","German 64%, French 20%, Italian 7% (all official); Romansch 0.5% (national)"]
["Thailand","Asia","Baht","Thai (Siamese), English (secondary language of the elite), ethnic and regional dialects"]
["Tunisia","Northern Africa","Dinar","Arabic (official, commerce), French (commerce)"]
["Turkey","Europe","Lira","Turkish (official), Kurdish, Dimli, Azeri, Kabardian"]
["United Arab Emirates","Middle East","Dirham","Arabic (official), Persian, English, Hindi, Urdu"]
["USA","North America","US Dollar","English 82%, Spanish 11% (2000)"]

{"sheet":"Ref.UKRegn","index":19,"n_rows":89,"n_cols":2,"rows_kept":89,"cut":false,"hidden":true,"merged":[]}
["Bedfordshire","East England"]
["Berkshire","South East England"]
["Bristol UA","South West England"]
["Buckinghamshire","South East England"]
["Cambridgeshire","East England"]
["Cheshire","North West England"]
["Cornwall","South West England"]
["Cumbria","North West England"]
["Derbyshire","East Midlands"]
["Devon","South West England"]
["Dorset","South West England"]
["Durham","North East England"]
["East Sussex","South East England"]
["East Yorkshire","Yorkshire and Humber"]
["Essex","East England"]
["Gloucestershire","South West England"]
["Hampshire","South East England"]
["Hereford/Worcs","West Midlands"]
["Hertfordshire","East England"]
["Hull UA","Yorkshire and Humber"]
["Isle of Wight","South East England"]
["Kent","South East England"]
["Lancashire","North West England"]
["Leicestershire","East Midlands"]
["Lincolnshire","East Midlands"]
["London","London"]
["Greater Manchester","North West England"]
["Merseyside","North West England"]
["Norfolk","East England"]
["Northamptonshire","East Midlands"]
["Northumberland","North East England"]
["North Yorkshire","Yorkshire and Humber"]
["Nottinghamshire","East Midlands"]
["Oxfordshire","South East England"]
["Shropshire","West Midlands"]
["Somerset","South West England"]
["South Yorkshire","Yorkshire and Humber"]
["Staffordshire","West Midlands"]
["Surrey","South East England"]
["Suffolk","East England"]
["Tees Valley","North East England"]
["Tyne & Wear","North East England"]
["Warwickshire","West Midlands"]
["West Midlands","West Midlands"]
["West Sussex","South East England"]
["West Yorkshire","Yorkshire and Humber"]
["Wiltshire","South West England"]
["England unspecified","England unspecified"]
["Argyle","Scotland"]
["Borders","Scotland"]
["Central","Scotland"]
["Dumfries & Galloway","Scotland"]
["Fife","Scotland"]
["Grampian","Scotland"]
["Greater Glasgow","Scotland"]
["Highlands","Scotland"]
["Islands","Scotland"]
["Lothian","Scotland"]
["Strathclyde","Scotland"]
["Tayside","Scotland"]
["Scotland unspecified","Scotland"]
["Aberconwy/Colwyn","Wales"]
["Anglesey","Wales"]
["Blaenau Gwent","Wales"]
["Bridgend","Wales"]
["Caernarfonshire/Meirionnydd","Wales"]
["Caerphilly","Wales"]
["Cardiff","Wales"]
["Cardiganshire","Wales"]
["Carmarthenshire","Wales"]
["Denbighshire","Wales"]
["Flintshire","Wales"]
["Merthyr Tydfil","Wales"]
["Monmouthshire","Wales"]
["Neath/Port Talbot","Wales"]
["Newport","Wales"]
["Pembrokeshire","Wales"]
["Powys","Wales"]
["Rhondda","Wales"]
["Swansea","Wales"]
["Torfaen","Wales"]
["Vale of Glamorgan","Wales"]
["Wrexham","Wales"]
["Wales unspecified","Wales"]
["Northern Ireland","Northern Ireland"]
["Nights spent Travelling","Travelling"]
["Isle Of Man","Isle of Man"]
["Channel Islands","Channel Islands"]
["UK area unknown","UK unspecified"]

{"sheet":"Ref.Curr.Rates","index":20,"n_rows":62,"n_cols":3,"rows_kept":62,"cut":false,"hidden":true,"merged":[[50,0,50,4],[0,0,0,4],[1,0,1,2],[47,0,47,4],[48,0,48,4],[49,0,49,4],[58,0,58,4],[59,0,59,4],[60,0,60,4],[61,0,61,4],[51,0,51,4],[52,0,52,4],[54,2,54,4],[55,2,55,4],[56,0,56,4],[57,0,57,4]]}
["Currency Rates Provided by MSN Money"]
["Click here to visit MSN Money"]
[]
["Name","In US$","   Per US$"]
["Argentina Peso - United States Dollar",0.11796,8.4770000000000003]
["Australian Dollar - United States Dollar",0.87609999999999999,1.141]
["Bahrain Dinar - United States Dollar",2.6362000000000001,0.379]
["Bolivia Bolvianos - United States Dollar",0.14366000000000001,6.9610000000000003]
["Brazil Real - United States Dollar",0.40642,2.4609999999999999]
["United Kingdom Pound - United States Dollar",1.6014999999999999,0.624]
["Canadian Dollar - United States Dollar",0.88739000000000001,1.127]
["Chile Peso - United States Dollar",1.6999999999999999E-3,588.20000000000005]
["China Yuan - United States Dollar",0.16328000000000001,6.1239999999999997]
["Colombia Peso - United States Dollar",4.8999999999999998E-4,2041]
["Czech Koruna - United States Dollar",4.6510000000000003E-2,21.501000000000001]
["Denmark Krone - United States Dollar",0.17207,5.8120000000000003]
["Euro - United States Dollar",1.2816000000000001,0.78]
["Egypt Pound - United States Dollar",0.13949,7.1689999999999996]
["Hong Kong Dollar - United States Dollar",0.12889999999999999,7.758]
["Hungary Forint - United States Dollar",4.1599999999999996E-3,240.4]
["India Rupee - United States Dollar",1.6219999999999998E-2,61.652000000000001]
["Indonesia Rupiah - United States Dollar",8.1499999999999993E-3,122.7]
["Japan Yen - United States Dollar",9.4500000000000001E-3,105.8]
["Jordan Dinar - United States Dollar",1.3972,0.71599999999999997]
["Kenya Shilling - United States Dollar",1.103E-2,90.662000000000006]
["Korea Won - United States Dollar",9.4049999999999995E-2,10.632999999999999]
["Kuwait Dinar - United States Dollar",3.4565000000000001,0.28899999999999998]
["Morocco Dihram - United States Dollar",0.11262,8.8789999999999996]
["Malaysia Ringgit - United States Dollar",0.30335000000000001,3.2970000000000002]
["Mexico New Peso - United States Dollar",7.3810000000000001E-2,13.548]
["Norway Krone - United States Dollar",0.15232999999999999,6.5650000000000004]
["Oman Rial - United States Dollar",2.5899000000000001,0.38600000000000001]
["Peru Nuevos Soles - United States Dollar",0.3422,2.9220000000000002]
["Philippines Peso - United States Dollar",2.2280000000000001E-2,44.883000000000003]
["Pakistan Rupee - United States Dollar",9.75E-3,102.6]
["Saudi Arabia Riyal - United States Dollar",0.26633000000000001,3.7549999999999999]
["Singapore Dollar - United States Dollar",0.78642000000000001,1.272]
["South Africa Rand - United States Dollar",8.9969999999999994E-2,11.115]
["Sweden Krona - United States Dollar",0.1391,7.1890000000000001]
["Switzerland Franc - United States Dollar",1.0621,0.94199999999999995]
["Taiwan New Dollar - United States Dollar",3.3349999999999998E-2,29.984999999999999]
["Thailand Bath - United States Dollar",3.082E-2,32.445999999999998]
["Tunisia Dinar - United States Dollar",0.55669999999999997,1.796]
["UAE Dirham - United States Dollar",0.27217999999999998,3.6739999999999999]
["United States Dollar",1,1]
["Venezuela Bolivar Fuertes - United States Dollar",0.15848000000000001,6.31]
[]
["DATA PROVIDERS"]
[]
["Copyright © 2014 Microsoft. All rights reserved."]
[]
["Fundamental company data and historical chart data provided by Morningstar Inc. Real-time index quotes and delayed quotes supplied by Morningstar Inc. Quotes delayed by up to 15 minutes, except where indicated otherwise. Fund summary, fund performance and dividend data provided by Morningstar Inc. Analyst recommendations provided by Zacks Investment Research. StockScouter data provided by Verus Analytics. IPO data provided by Hoover's Inc. Index membership data provided by Morningstar Inc."]
[]
[]
["MSN Money",null,"Microsoft Office Update"]
["Discover Investor's tools, columns, and more!",null,"Get the latest from Microsoft Office"]
["MSN Privacy"]
["Legal"]
["Advertise"]
["MSN Worldwide"]
["About our ads"]
["© 2014 Microsoft "]